Methane, trichloronitroso-
- Formula: CCl3NO
- Molecular weight: 148.376
- IUPAC Standard InChIKey: WXWITNRAXGTELB-UHFFFAOYSA-N
- CAS Registry Number: 3711-49-7
- Chemical structure:
View 3d structure (requires JavaScript / HTML 5) - Permanent link for this species. Use this link for bookmarking this species for future reference.

Phase change data

Data compiled by: William E. Acree, Jr., James S. Chickos
Enthalpy of vaporization
ΔvapH (kJ/mol) | Temperature (K) | Method | Reference | Comment |
---|---|---|---|---|
32.4 | 268. | A | Stephenson and Malanowski, 1987 | Based on data from 253. to 333. K. |

Gas phase ion energetics data

Data compiled by: Sharon G. Lias, Rhoda D. Levin, and Sherif A. Kafafi
Appearance energy determinations
Ion | AE (eV) | Other Products | Method | Reference | Comment |
---|---|---|---|---|---|
CNOCl3+ | 10.30 ± 0.05 | ? | PE | Ernsting, Pfab, et al., 1980 | Vertical value |

References

Stephenson and Malanowski, 1987
Stephenson, Richard M.; Malanowski, Stanislaw,
Handbook of the Thermodynamics of Organic Compounds, 1987, https://doi.org/10.1007/978-94-009-3173-2
. [all data]
Ernsting, Pfab, et al., 1980
Ernsting, N.P.; Pfab, J.; Green, J.C.; Romelt, J.,
Photoelectron spectra of nitrosomethane, t-nitrosobutane and some perhalogenonitrosomethanes,
J. Chem. Soc. Faraday Trans. 2, 1980, 76, 844. [all data]