Hydrazine, 1,2-bis(2-methylpropyl)-
- Formula: C8H20N2
- Molecular weight: 144.2578
- IUPAC Standard InChIKey: GHXZZOARPRFXEH-UHFFFAOYSA-N
- CAS Registry Number: 3711-37-3
- Chemical structure:
View 3d structure (requires JavaScript / HTML 5) - Permanent link for this species. Use this link for bookmarking this species for future reference.

Gas phase ion energetics data

Data compiled by: Sharon G. Lias, Rhoda D. Levin, and Sherif A. Kafafi
Ionization energy determinations
IE (eV) | Method | Reference | Comment |
---|---|---|---|
8.70 | PE | Rademacher, 1975 | Vertical value |

References

Rademacher, 1975
Rademacher, P.,
Acyclische Hydrazine,
Chem. Ber., 1975, 108, 1548. [all data]