Hydrazine, 1,2-bis(1-methylethyl)-
- Formula: C6H16N2
- Molecular weight: 116.2046
- IUPAC Standard InChIKey: QWLQTDXXEZQUBB-UHFFFAOYSA-N
- CAS Registry Number: 3711-34-0
- Chemical structure:
View 3d structure (requires JavaScript / HTML 5) - Other names: Hydrazine, 1,2-diisopropyl-; 1,2-Diisopropylhydrazine; N,N'-Diisopropylhydrazine

Phase change data

Data compiled by: Robert L. Brown and Stephen E. Stein
Quantity | Value | Units | Method | Reference | Comment |
---|---|---|---|---|---|
Tboil | 398.2 | K | N/A | Weast and Grasselli, 1989 |

Gas phase ion energetics data

Data compiled by: Sharon G. Lias, Rhoda D. Levin, and Sherif A. Kafafi
Ionization energy determinations
IE (eV) | Method | Reference | Comment |
---|---|---|---|
8.45 | PE | Rademacher, 1975 | Vertical value |
8.59 | PE | Nelsen and Buschek, 1974 | Vertical value |
8.34 | PE | Rademacher, 1973 | Vertical value |

Normal alkane RI, non-polar column, temperature ramp

Column type | Active phase | I | Reference | Comment |
---|---|---|---|---|
Capillary | OV-101 | 803. | Zenkevich, 2005 | 25. m/0.20 mm/0.10 μm, N2/He, 6. K/min; Tstart: 50. C; Tend: 250. C |

References

Weast and Grasselli, 1989
CRC Handbook of Data on Organic Compounds, 2nd Editon, Weast,R.C and Grasselli, J.G., ed(s)., CRC Press, Inc., Boca Raton, FL, 1989, 1. [all data]
Rademacher, 1975
Rademacher, P.,
Acyclische Hydrazine,
Chem. Ber., 1975, 108, 1548. [all data]
Nelsen and Buschek, 1974
Nelsen, S.F.; Buschek, J.M.,
Photoelectron spectra of hydrazines. III. Evidence for similar lone pair-lone pair dihedral angles for acyclic hydrazines,
J. Am. Chem. Soc., 1974, 96, 2392. [all data]
Rademacher, 1973
Rademacher, P.,
Photoelectron spectra and conformation of hydrazine derivatives,
Angew. Chem. Int. Ed. Engl., 1973, 12, 408. [all data]
Zenkevich, 2005
Zenkevich, I.G.,
Experimentally measured retention indices., 2005. [all data]