Benzene, 1-fluoro-4-(2-phenylethyl)-
- Formula: C14H13F
- Molecular weight: 200.2514
- IUPAC Standard InChIKey: LGAWAQNSZFCGMP-UHFFFAOYSA-N
- CAS Registry Number: 370-76-3
- Chemical structure:
View 3d structure (requires JavaScript / HTML 5) - Other names: Bibenzyl, 4-fluoro-; 4-Fluorobibenzyl; 1-(4-Fluorophenyl)-2-phenylethane; L-(4-Fluorophenyl)-2-phenylethane

Gas phase ion energetics data

Data compiled by: Henry M. Rosenstock, Keith Draxl, Bruce W. Steiner, and John T. Herron
Ionization energy determinations
IE (eV) | Method | Reference |
---|---|---|
8.8 ± 0.1 | EI | McLafferty, Wachs, et al., 1970 |
Appearance energy determinations
Ion | AE (eV) | Other Products | Method | Reference | Comment |
---|---|---|---|---|---|
C7H6F+ | 10.7 ± 0.2 | ? | EI | McLafferty, Wachs, et al., 1970 | |
C7H7+ | 11.0 ± 0.2 | ? | EI | McLafferty, Wachs, et al., 1970 |

References

McLafferty, Wachs, et al., 1970
McLafferty, F.W.; Wachs, T.; Lifshitz, C.; Innorta, G.; Irving, P.,
Substituent effects in unimolecular ion decompositions. XV. Mechanistic interpretations and the quasi-equilibrium theory,
J. Am. Chem. Soc., 1970, 92, 6867. [all data]