3,4-Decadiene
- Formula: C10H18
- Molecular weight: 138.2499
- IUPAC Standard InChIKey: ZLEWGEATDZBCIM-UHFFFAOYSA-N
- CAS Registry Number: 37050-04-7
- Chemical structure:
View 3d structure (requires JavaScript / HTML 5) - Other names: 3,4-Nonadiene

Gas phase ion energetics data

Data compiled by: Henry M. Rosenstock, Keith Draxl, Bruce W. Steiner, and John T. Herron
Appearance energy determinations
Ion | AE (eV) | Other Products | Method | Reference | Comment |
---|---|---|---|---|---|
C5H7+ | 11.9 | ? | EI | Polyakova, Zimina, et al., 1960 |

References

Polyakova, Zimina, et al., 1960
Polyakova, A.A.; Zimina, K.I.; Petrov, A.A.; Khmel'nitskii, R.A.,
Mass spectra and structure of some allenes,
Zh. Obshch. Khim., 1960, 30, 2977, In original 2949. [all data]