N,N-Bis(trifluoromethyl)aniline
- Formula: C8H5F6N
- Molecular weight: 229.1224
- IUPAC Standard InChIKey: JBGNFLUETJDDBA-UHFFFAOYSA-N
- CAS Registry Number: 3700-19-4
- Chemical structure:
View 3d structure (requires JavaScript / HTML 5) - Permanent link for this species. Use this link for bookmarking this species for future reference.

Gas phase ion energetics data

Data compiled by: Henry M. Rosenstock, Keith Draxl, Bruce W. Steiner, and John T. Herron
Ionization energy determinations
IE (eV) | Method | Reference | Comment |
---|---|---|---|
10.00 | PE | Baker, May, et al., 1968 | Vertical value |

References

Baker, May, et al., 1968
Baker, A.D.; May, D.P.; Turner, D.W.,
Molecular photoelectron spectroscopy. Part VII. The vertical ionisation potentials of benzene and some of its monosubstituted and 1,4-disubstituted derivatives,
J. Chem. Soc. B, 1968, 22. [all data]