Cyclopropene-carboxaldehyde
- Formula: C4H4O
- Molecular weight: 68.0740
- IUPAC Standard InChIKey: DNFUTEXWYLMSIZ-UHFFFAOYSA-N
- CAS Registry Number: 36998-21-7
- Chemical structure:
View 3d structure (requires JavaScript / HTML 5) - Permanent link for this species. Use this link for bookmarking this species for future reference.

Gas phase ion energetics data

Data compiled as indicated in comments:
LLK - Sharon G. Lias, Rhoda D. Levin, and Sherif A. Kafafi
Ionization energy determinations
IE (eV) | Method | Reference | Comment |
---|---|---|---|
~9.6 | EI | Holmes and Terlouw, 1979 | LLK |

References

Holmes and Terlouw, 1979
Holmes, J.L.; Terlouw, J.K.,
Structures of [C4H4O]+ ions produced from 2- and 4-pyrone,
J. Am. Chem. Soc., 1979, 101, 4973. [all data]