Chrysene, 5-methyl-
- Formula: C19H14
- Molecular weight: 242.3145
- IUPAC Standard InChIKey: GOHBXWHNJHENRX-UHFFFAOYSA-N
- CAS Registry Number: 3697-24-3
- Chemical structure:
View 3d structure (requires JavaScript / HTML 5) - Other names: 5-Methylchrysene

Phase change data

Data compiled as indicated in comments:
TRC - Thermodynamics Research Center, NIST Boulder Laboratories, Chris Muzny director
AC - William E. Acree, Jr., James S. Chickos
Quantity | Value | Units | Method | Reference | Comment |
---|---|---|---|---|---|
Tfus | 389. | K | N/A | Newman, 1940 | Uncertainty assigned by TRC = 4. K; TRC |
Tfus | 391. | K | N/A | Newman, 1940 | Uncertainty assigned by TRC = 1. K; TRC |
Enthalpy of fusion
ΔfusH (kJ/mol) | Temperature (K) | Method | Reference | Comment |
---|---|---|---|---|
19.0 | 390.7 | DSC | Kestens, Auclair, et al., 2010 | AC |

Gas phase ion energetics data

Data compiled as indicated in comments:
LLK - Sharon G. Lias, Rhoda D. Levin, and Sherif A. Kafafi
Ionization energy determinations
IE (eV) | Method | Reference | Comment |
---|---|---|---|
7.40 ± 0.03 | PE | Shahbaz, Akiyama, et al., 1981 | LLK |

References

Newman, 1940
Newman, M.S.,
The Synthesis of 5-Methylchyrsene and Related Compounds,
J. Am. Chem. Soc., 1940, 62, 870. [all data]
Kestens, Auclair, et al., 2010
Kestens, Vikram; Auclair, Guy; Drozdzewska, Katarzyna; Held, Andrea; Roebben, Gert; Linsinger, Thomas,
Thermodynamic property values of selected polycyclic aromatic hydrocarbons measured by differential scanning calorimetry,
J Therm Anal Calorim, 2010, 99, 1, 245-261, https://doi.org/10.1007/s10973-009-0440-6
. [all data]
Shahbaz, Akiyama, et al., 1981
Shahbaz, M.; Akiyama, I.; LeBreton, P.,
Ultraviolet photoelectron studies of methyl substituted chrysenes,
Biochem. Biophys. Res. Commun., 1981, 103, 25. [all data]