Phenol, 2,4-dibromo-, acetate
- Formula: C8H6Br2O2
- Molecular weight: 293.940
- IUPAC Standard InChIKey: RXBCSBQMWRLETO-UHFFFAOYSA-N
- CAS Registry Number: 36914-79-1
- Chemical structure:
View 3d structure (requires JavaScript / HTML 5) - Other names: Acetic acid, 2,4-dibromophenyl ester

Gas phase ion energetics data

Data compiled by: Sharon G. Lias, Rhoda D. Levin, and Sherif A. Kafafi
Ionization energy determinations
IE (eV) | Method | Reference |
---|---|---|
8.21 ± 0.03 | EI | Benezra and Bursey, 1972 |
Appearance energy determinations
Ion | AE (eV) | Other Products | Method | Reference | Comment |
---|---|---|---|---|---|
C2H3O+ | 12.01 ± 0.03 | ? | EI | Benezra and Bursey, 1972 | |
C6H4OBr2+ | 9.45 ± 0.03 | CH2=C=O | EI | Benezra and Bursey, 1972 |

References

Benezra and Bursey, 1972
Benezra, S.A.; Bursey, M.M.,
ortho-Effects in mass spectra. Alteration of the molecular-ion energy distribution in disubstituted acetanilides,
Z. Naturforsch. A:, 1972, 27, 670. [all data]