Phenol,2,4-difluoro-,acetate
- Formula: C8H6F2O2
- Molecular weight: 172.1288
- IUPAC Standard InChIKey: SJMMFGNAJFFWNL-UHFFFAOYSA-N
- CAS Registry Number: 36914-77-9
- Chemical structure:
View 3d structure (requires JavaScript / HTML 5) - Permanent link for this species. Use this link for bookmarking this species for future reference.

Gas phase ion energetics data

Data compiled by: Sharon G. Lias, Rhoda D. Levin, and Sherif A. Kafafi
Ionization energy determinations
IE (eV) | Method | Reference |
---|---|---|
8.60 ± 0.03 | EI | Benezra and Bursey, 1972 |
Appearance energy determinations
Ion | AE (eV) | Other Products | Method | Reference | Comment |
---|---|---|---|---|---|
C2H3O+ | 12.00 ± 0.03 | ? | EI | Benezra and Bursey, 1972 | |
C6H4OF2+ | 9.63 ± 0.03 | CH2=C=O | EI | Benezra and Bursey, 1972 |

References

Benezra and Bursey, 1972
Benezra, S.A.; Bursey, M.M.,
ortho-Effects in mass spectra. Alteration of the molecular-ion energy distribution in disubstituted acetanilides,
Z. Naturforsch. A:, 1972, 27, 670. [all data]