Dinitrogen monohydride
- Formula: HN2
- Molecular weight: 29.0213
- CAS Registry Number: 36882-13-0

Gas phase ion energetics data

Data compiled by: Sharon G. Lias, Rhoda D. Levin, and Sherif A. Kafafi
Ionization energy determinations
IE (eV) | Method | Reference |
---|---|---|
7.8 ± 0.05 | EI | Wiberg, Fischer, et al., 1979 |

References

Wiberg, Fischer, et al., 1979
Wiberg, N.; Fischer, G.; Bachhuber, H.,
Diazen und andere Distickstoffhydride: Bildungswarmen, Dissoziationsenergien, Auftrittspotentiale, Protonenaffinitaten,
Z. Naturforsch. B:, 1979, 34, 1385. [all data]