Trifluorophenylsilane
- Formula: C6H5F3Si
- Molecular weight: 162.1846
- IUPAC Standard InChIKey: KGWNTHHPMKEAIK-UHFFFAOYSA-N
- CAS Registry Number: 368-47-8
- Chemical structure:
View 3d structure (requires JavaScript / HTML 5) - Other names: Phenyl trifluorosilane

Phase change data

Data compiled as indicated in comments:
AC - William E. Acree, Jr., James S. Chickos
Enthalpy of vaporization
ΔvapH (kJ/mol) | Temperature (K) | Reference | Comment |
---|---|---|---|
40.1 | 257. | Stull, 1947 | Based on data from 242. to 371. K.; AC |
Antoine Equation Parameters
log10(P) = A − (B / (T + C))
P = vapor pressure (bar)
T = temperature (K)
View plot Requires a JavaScript / HTML 5 canvas capable browser.
Temperature (K) | A | B | C | Reference | Comment |
---|---|---|---|---|---|
242. to 371.5 | 4.57795 | 1525.598 | -37.521 | Stull, 1947 | Coefficents calculated by NIST from author's data. |

Reaction thermochemistry data

Data compiled by: John E. Bartmess
Individual Reactions
+
= C6H6F3Si-
By formula: H- + C6H5F3Si = C6H6F3Si-
Quantity | Value | Units | Method | Reference | Comment |
---|---|---|---|---|---|
ΔrH° | 268. ± 13. | kJ/mol | CIDT | Krouse, Lardin, et al., 2003 | gas phase |
+
= C6H5F4Si-
By formula: F- + C6H5F3Si = C6H5F4Si-
Quantity | Value | Units | Method | Reference | Comment |
---|---|---|---|---|---|
ΔrH° | 332. ± 14. | kJ/mol | CIDT | Krouse, Lardin, et al., 2003 | gas phase |
CH3O- + = C7H8F3OSi-
By formula: CH3O- + C6H5F3Si = C7H8F3OSi-
Quantity | Value | Units | Method | Reference | Comment |
---|---|---|---|---|---|
ΔrH° | 320. ± 25. | kJ/mol | CIDT | Krouse, Lardin, et al., 2003 | gas phase |

Gas phase ion energetics data

Data compiled by: Sharon G. Lias, John E. Bartmess, Joel F. Liebman, John L. Holmes, Rhoda D. Levin, and W. Gary Mallard
Ionization energy determinations
IE (eV) | Method | Reference | Comment |
---|---|---|---|
10.23 | PE | Veszpremi, Harada, et al., 1984 | Vertical value |

Ion clustering data

Data compiled by: John E. Bartmess
Clustering reactions
CH3O- + = C7H8F3OSi-
By formula: CH3O- + C6H5F3Si = C7H8F3OSi-
Quantity | Value | Units | Method | Reference | Comment |
---|---|---|---|---|---|
ΔrH° | 320. ± 25. | kJ/mol | CIDT | Krouse, Lardin, et al., 2003 | gas phase |
+
= C6H5F4Si-
By formula: F- + C6H5F3Si = C6H5F4Si-
Quantity | Value | Units | Method | Reference | Comment |
---|---|---|---|---|---|
ΔrH° | 332. ± 14. | kJ/mol | CIDT | Krouse, Lardin, et al., 2003 | gas phase |
+
= C6H6F3Si-
By formula: H- + C6H5F3Si = C6H6F3Si-
Quantity | Value | Units | Method | Reference | Comment |
---|---|---|---|---|---|
ΔrH° | 268. ± 13. | kJ/mol | CIDT | Krouse, Lardin, et al., 2003 | gas phase |

References

Stull, 1947
Stull, Daniel R.,
Vapor Pressure of Pure Substances. Organic and Inorganic Compounds,
Ind. Eng. Chem., 1947, 39, 4, 517-540, https://doi.org/10.1021/ie50448a022
. [all data]
Krouse, Lardin, et al., 2003
Krouse, I.H.; Lardin, H.A.; Wenthold, P.G.,
Gas-phase ion chemistry and ion thermochemistry of phenyltrifluorosilane,
Int. J. Mass Spectrom., 2003, 227, 3, 303-314, https://doi.org/10.1016/S1387-3806(03)00080-0
. [all data]
Veszpremi, Harada, et al., 1984
Veszpremi, T.; Harada, Y.; Ohno, K.; Mutoh, H., Jr.,
Photoelectron and penning electron spectroscopic investigation of phenylhalosilanes,
J. Organomet. Chem., 1984, 266, 9. [all data]