2,4-Pentanedione, 1,1,1-trifluoro-
- Formula: C5H5F3O2
- Molecular weight: 154.0872
- IUPAC Standard InChIKey: SHXHPUAKLCCLDV-UHFFFAOYSA-N
- CAS Registry Number: 367-57-7
- Chemical structure:
View 3d structure (requires JavaScript / HTML 5) - Other names: (Trifluoroacetyl)acetone; 1,1,1-Trifluoro-2,4-pentanedione; 1,1,1-Trifluoroacetylacetone; CF3COH=CHCOCH3; 1,1,1-Trifluoro-2,4-pentadione; Acetyl trifluoroacetone; 1,1,1-trifluoropentane-2,4-dione

Gas phase thermochemistry data

Data compiled by: Hussein Y. Afeefy, Joel F. Liebman, and Stephen E. Stein
Quantity | Value | Units | Method | Reference | Comment |
---|---|---|---|---|---|
ΔfH°gas | -1003.3 ± 3.3 | kJ/mol | Ccr | Erastov, Kolesov, et al., 1984 | Hf-gas-(enol) |
ΔfH°gas | -993.3 ± 3.4 | kJ/mol | Ccr | Erastov, Kolesov, et al., 1984 | Hf-gas-(keto) |

Condensed phase thermochemistry data

Data compiled by: Hussein Y. Afeefy, Joel F. Liebman, and Stephen E. Stein
Quantity | Value | Units | Method | Reference | Comment |
---|---|---|---|---|---|
ΔfH°liquid | -1040.2 ± 3.3 | kJ/mol | Ccr | Erastov, Kolesov, et al., 1984 | Hf-gas-(enol) |
Quantity | Value | Units | Method | Reference | Comment |
ΔcH°liquid | -2179.9 ± 2.6 | kJ/mol | Ccr | Erastov, Kolesov, et al., 1984 | Hf-gas-(enol) |

Phase change data

Data compiled as indicated in comments:
BS - Robert L. Brown and Stephen E. Stein
AC - William E. Acree, Jr., James S. Chickos
Quantity | Value | Units | Method | Reference | Comment |
---|---|---|---|---|---|
Tboil | 379.2 | K | N/A | Aldrich Chemical Company Inc., 1990 | BS |
Tboil | 380. | K | N/A | Farchan Laboratories, 1990 | BS |
Tboil | 380. | K | N/A | PCR Inc., 1990 | BS |
Tboil | 380.2 | K | N/A | Majer and Svoboda, 1985 | |
Quantity | Value | Units | Method | Reference | Comment |
ΔvapH° | 37.27 | kJ/mol | N/A | Majer and Svoboda, 1985 | |
ΔvapH° | 37.2 ± 0.2 | kJ/mol | N/A | Ribeiro da Silva, Gonçalves, et al., 1997 | See also Irving and da Silva, 1975 and Ribeiro da Silva and Irving, 1978.; AC |
Enthalpy of vaporization
ΔvapH (kJ/mol) | Temperature (K) | Reference |
---|---|---|
31.21 | 380.2 | Majer and Svoboda, 1985 |

Reaction thermochemistry data

Data compiled by: John E. Bartmess
Individual Reactions
C5H4F3O2- + =
By formula: C5H4F3O2- + H+ = C5H5F3O2
Quantity | Value | Units | Method | Reference | Comment |
---|---|---|---|---|---|
ΔrH° | 1374. ± 12. | kJ/mol | G+TS | Fujio, McIver, et al., 1981 | gas phase; value altered from reference due to change in acidity scale |
ΔrH° | 1374. ± 17. | kJ/mol | G+TS | Cumming and Kebarle, 1978 | gas phase |
Quantity | Value | Units | Method | Reference | Comment |
ΔrG° | 1347. ± 8.4 | kJ/mol | IMRE | Fujio, McIver, et al., 1981 | gas phase; value altered from reference due to change in acidity scale |
ΔrG° | 1348. ± 8.4 | kJ/mol | IMRE | Cumming and Kebarle, 1978 | gas phase |

Gas phase ion energetics data

Data compiled as indicated in comments:
B - John E. Bartmess
LL - Sharon G. Lias and Joel F. Liebman
LLK - Sharon G. Lias, Rhoda D. Levin, and Sherif A. Kafafi
RDSH - Henry M. Rosenstock, Keith Draxl, Bruce W. Steiner, and John T. Herron
Ionization energy determinations
IE (eV) | Method | Reference | Comment |
---|---|---|---|
9.47 | EI | Orlov, Rashkes, et al., 1988 | LL |
9.5 | PE | Evans, Hamnett, et al., 1972 | LLK |
9.8 ± 0.1 | EI | Reichert, Bancroft, et al., 1970 | RDSH |
9.92 ± 0.07 | PE | Evans, Hamnett, et al., 1972 | Vertical value; LLK |
Appearance energy determinations
Ion | AE (eV) | Other Products | Method | Reference | Comment |
---|---|---|---|---|---|
C2H3O+ | 10.20 | C3H2F3O | EI | Orlov, Rashkes, et al., 1988 | LL |
C4H2O2F3+ | 11.7 ± 0.1 | CH3 | EI | Reichert, Bancroft, et al., 1970 | RDSH |
C4H5O2+ | 10.6 ± 0.2 | CF3 | EI | Reichert, Bancroft, et al., 1970 | RDSH |
De-protonation reactions
C5H4F3O2- + =
By formula: C5H4F3O2- + H+ = C5H5F3O2
Quantity | Value | Units | Method | Reference | Comment |
---|---|---|---|---|---|
ΔrH° | 1374. ± 12. | kJ/mol | G+TS | Fujio, McIver, et al., 1981 | gas phase; value altered from reference due to change in acidity scale; B |
ΔrH° | 1374. ± 17. | kJ/mol | G+TS | Cumming and Kebarle, 1978 | gas phase; B |
Quantity | Value | Units | Method | Reference | Comment |
ΔrG° | 1347. ± 8.4 | kJ/mol | IMRE | Fujio, McIver, et al., 1981 | gas phase; value altered from reference due to change in acidity scale; B |
ΔrG° | 1348. ± 8.4 | kJ/mol | IMRE | Cumming and Kebarle, 1978 | gas phase; B |

References

Erastov, Kolesov, et al., 1984
Erastov, P.A.; Kolesov, V.P.; Igumenov, I.K.,
Standard enthalpies of formation of some fluorinated β-diketones,
Russ. J. Phys. Chem. (Engl. Transl.), 1984, 58, 1311-1313. [all data]
Aldrich Chemical Company Inc., 1990
Aldrich Chemical Company Inc.,
Catalog Handbook of Fine Chemicals, Aldrich Chemical Company, Inc., Milwaukee WI, 1990, 1. [all data]
Farchan Laboratories, 1990
Farchan Laboratories,
Research Chemicals Catalog, Farchan Laboratories, Gainesville, FL, 1990, 91. [all data]
PCR Inc., 1990
PCR Inc.,
Research Chemicals Catalog 1990-1991, PCR Inc., Gainesville, FL, 1990, 1. [all data]
Majer and Svoboda, 1985
Majer, V.; Svoboda, V.,
Enthalpies of Vaporization of Organic Compounds: A Critical Review and Data Compilation, Blackwell Scientific Publications, Oxford, 1985, 300. [all data]
Ribeiro da Silva, Gonçalves, et al., 1997
Ribeiro da Silva, Manuel A.V.; Gonçalves, J.M.; Pilcher, G.,
Standard molar enthalpies of formation of nine fluorinated β-diketones by rotating bomb calorimetry,
The Journal of Chemical Thermodynamics, 1997, 29, 3, 253-260, https://doi.org/10.1006/jcht.1996.0143
. [all data]
Irving and da Silva, 1975
Irving, Roger J.; da Silva, Manuel A.V. Ribeiro,
Enthalpies of vaporization of some ?-diketones,
J. Chem. Soc., Dalton Trans., 1975, 9, 798, https://doi.org/10.1039/dt9750000798
. [all data]
Ribeiro da Silva and Irving, 1978
Ribeiro da Silva, M.A.V.; Irving, R.G.,
Rev. Port. Quim., 1978, 20, 36. [all data]
Fujio, McIver, et al., 1981
Fujio, M.; McIver, R.T., Jr.; Taft, R.W.,
Effects on the acidities of phenols from specific substituent-solvent interactions. Inherent substituent parameters from gas phase acidities,
J. Am. Chem. Soc., 1981, 103, 4017. [all data]
Cumming and Kebarle, 1978
Cumming, J.B.; Kebarle, P.,
Summary of gas phase measurements involving acids AH. Entropy changes in proton transfer reactions involving negative ions. Bond dissociation energies D(A-H) and electron affinities EA(A),
Can. J. Chem., 1978, 56, 1. [all data]
Orlov, Rashkes, et al., 1988
Orlov, V.M.; Rashkes, Y.V.; Siretskaya, T.V.; Takhistov, V.V.,
Thermochemical description of tutomeric transformations in ionized 1,3-diketones,
J. Gen. Chem. USSR, 1988, 58, 374. [all data]
Evans, Hamnett, et al., 1972
Evans, S.; Hamnett, A.; Orchard, A.F.; Lloyd, D.R.,
Study of the metal-oxygen bond in simple tris-chelate complexes by He(I) photoelectron spectroscopy,
Faraday Discuss. Chem. Soc., 1972, 54, 227. [all data]
Reichert, Bancroft, et al., 1970
Reichert, C.; Bancroft, G.M.; Westmore, J.B.,
Mass spectral studies of metal chelates. V. Mass spectra and appearance potentials of some fluorine-substituted acetylacetonates,
Can. J. Chem., 1970, 48, 1362. [all data]
Larsen and Leddy, 1953
Larsen, E.M.; Leddy, J.,
J. Am. Chem. Soc., 1953, 75, 5107. [all data]