Phenanthrene, 4,5-dimethyl-
- Formula: C16H14
- Molecular weight: 206.2824
- IUPAC Standard InChIKey: GWWHAAHVHHLOQW-UHFFFAOYSA-N
- CAS Registry Number: 3674-69-9
- Chemical structure:
View 3d structure (requires JavaScript / HTML 5) - Other names: 4,5-Dimethylphenanthrene; 4,5-methylphenanthrene

Condensed phase thermochemistry data

Data compiled by: Hussein Y. Afeefy, Joel F. Liebman, and Stephen E. Stein
Quantity | Value | Units | Method | Reference | Comment |
---|---|---|---|---|---|
ΔfH°solid | 88.9 ± 5.9 | kJ/mol | Ccb | Frisch, 1962 | see Frisch, Barker, et al., 1963 |
Quantity | Value | Units | Method | Reference | Comment |
ΔcH°solid | -8385.9 ± 5.9 | kJ/mol | Ccb | Frisch, 1962 | see Frisch, Barker, et al., 1963; Corresponding ΔfHºsolid = 88.95 kJ/mol (simple calculation by NIST; no Washburn corrections) |

Phase change data

Data compiled by: William E. Acree, Jr., James S. Chickos
Enthalpy of sublimation
ΔsubH (kJ/mol) | Temperature (K) | Method | Reference | Comment |
---|---|---|---|---|
85.7 | 383. | GS | Nass, Lenoir, et al., 1995 | Based on data from 313. to 453. K. |

Gas phase ion energetics data

Data compiled as indicated in comments:
LLK - Sharon G. Lias, Rhoda D. Levin, and Sherif A. Kafafi
RDSH - Henry M. Rosenstock, Keith Draxl, Bruce W. Steiner, and John T. Herron
Ionization energy determinations
IE (eV) | Method | Reference | Comment |
---|---|---|---|
7.6 ± 0.1 | EI | Dougherty, Bertorello, et al., 1971 | LLK |
7.53 ± 0.04 | EI | Nounou, 1966 | RDSH |
Appearance energy determinations
Ion | AE (eV) | Other Products | Method | Reference | Comment |
---|---|---|---|---|---|
C13H9+ | 12.4 ± 0.1 | ? | EI | Dougherty, Bertorello, et al., 1971 | LLK |
C15H9+ | 15.1 ± 0.1 | ? | EI | Dougherty, Bertorello, et al., 1971 | LLK |
C15H10+ | 15.3 ± 0.2 | ? | EI | Nounou, 1966 | RDSH |
C15H11+ | 10.8 ± 0.1 | CH3 | EI | Dougherty, Bertorello, et al., 1971 | LLK |
C15H11+ | 10.8 ± 0.1 | CH3 | EI | Nounou, 1966 | RDSH |
C16H9+ | 12.5 ± 0.2 | 2H2+H | EI | Nounou, 1966 | RDSH |
C16H10+ | >16. | ? | EI | Dougherty, Bertorello, et al., 1971 | LLK |
C16H10+ | 13.0 ± 0.2 | 2H2 | EI | Nounou, 1966 | RDSH |
C16H13+ | 12.3 ± 0.1 | H | EI | Dougherty, Bertorello, et al., 1971 | LLK |

Kovats' RI, non-polar column, isothermal

Column type | Active phase | Temperature (C) | I | Reference | Comment |
---|---|---|---|---|---|
Packed | OV-101 | 230. | 1963. | Grimmer and Böhnke, 1975 | Gas Chrom Q; Column length: 10. m |

Van Den Dool and Kratz RI, non-polar column, temperature ramp

Column type | Active phase | I | Reference | Comment |
---|---|---|---|---|
Capillary | OV-1 | 1979.8 | Zhang, Shen, et al., 2000 | 25. m/0.2 mm/0.33 μm, 5. K/min; Tstart: 100. C; Tend: 180. C |

Normal alkane RI, non-polar column, custom temperature program

Column type | Active phase | I | Reference | Comment |
---|---|---|---|---|
Packed | OV-101 | 1963. | Kaliszan and Lamparczyk, 1978 | Program: not specified |

Lee's RI, non-polar column, temperature ramp

Column type | Active phase | I | Reference | Comment |
---|---|---|---|---|
Capillary | CP Sil 8 CB | 327.16 | Garrigues, Parlanti, et al., 1987 | 50. m/0.22 mm/0.13 μm, H2, 120. C @ 2. min, 3. K/min; Tend: 270. C |

References

Frisch, 1962
Frisch, M.A.,
A high precision calorimeter for ther measurement of small energy differences, Ph.D. Thesis for University of Wisconsin, 1962, 1-100. [all data]
Frisch, Barker, et al., 1963
Frisch, M.A.; Barker, C.; Margrave, J.L.; Newman, M.S.,
Strain energies in hydrocarbons from heats to combustion. I. 4,5-and 2,7-dimethylphenanthrenes, 1,12- and 5,8-benzo(c)phenanthrenes and 1',9- and 3',6-benzanthracenes,
J. Am. Chem. Soc., 1963, 85, 2356-2357. [all data]
Nass, Lenoir, et al., 1995
Nass, Karen; Lenoir, Dieter; Kettrup, Antonius,
Calculation of the Thermodynamic Properties of Polycyclic Aromatic Hydrocarbons by an Incremental Procedure,
Angew. Chem. Int. Ed. Engl., 1995, 34, 16, 1735-1736, https://doi.org/10.1002/anie.199517351
. [all data]
Dougherty, Bertorello, et al., 1971
Dougherty, R.C.; Bertorello, H.E.; Martinez de Bertorello, M.,
Mass spectra and thermochemistry of methyl phenanthrenes. A contribution to the analogy between mass spectral and thermal fragmentation reactions,
Org. Mass Spectrom., 1971, 5, 1321. [all data]
Nounou, 1966
Nounou, P.,
Etude des composes aromatiques par spectrometrie de masse. I. Mesure des potentials d'ionisation et d'apparition par la methode du potential retardateur et interpretation des courbes d'ionisation differentielle,
J. Chim. Phys., 1966, 63, 994. [all data]
Grimmer and Böhnke, 1975
Grimmer, G.; Böhnke, H.,
Polycyclic aromatic hydrocarbon profile analysis of high-protein foods, oils, and fats by gas chromatography,
J. Ass. Offic. Anal. Chem, 1975, 58, 4, 725-733. [all data]
Zhang, Shen, et al., 2000
Zhang, M.-J.; Shen, S.-D.; Chen, S.-Y.; Sun, Y.-H.,
Analysis of heavy oil fractions in high-temperature coal tar by capillary gas chromatography/fourier transform infrared spectrometry,
Chin. J. Chromatogr., 2000, 18, 3, 241-246. [all data]
Kaliszan and Lamparczyk, 1978
Kaliszan, R.; Lamparczyk, H.,
A Relationship between the Connectivity Indices and Retention Indices of Polycyclic Aromatic Hydrocarbons,
J. Chromatogr. Sci., 1978, 16, 6, 246-248, https://doi.org/10.1093/chromsci/16.6.246
. [all data]
Garrigues, Parlanti, et al., 1987
Garrigues, P.; Parlanti, E.; Radke, M.; Bellocq, J.; Willsch, H.; Ewald, M.,
Identification of alkylphenanthrenes in shale oil and coal by liquid and capillary gas chromatography and high-resolution spectrofluorimetry (Shpol'skii effect),
J. Chromatogr., 1987, 395, 217-228, https://doi.org/10.1016/S0021-9673(01)94112-3
. [all data]