Phenanthrene, 2,5-dimethyl-
- Formula: C16H14
- Molecular weight: 206.2824
- IUPAC Standard InChIKey: ANBPQRLLOPVKIG-UHFFFAOYSA-N
- CAS Registry Number: 3674-66-6
- Chemical structure:
View 3d structure (requires JavaScript / HTML 5) - Other names: 2,5-Dimethyl-phenanthrene

Phase change data

Data compiled by: Robert L. Brown and Stephen E. Stein
Reduced pressure boiling point
Tboil (K) | Pressure (bar) | Reference |
---|---|---|
477.7 | 0.020 | Weast and Grasselli, 1989 |

Gas phase ion energetics data

Data compiled by: Henry M. Rosenstock, Keith Draxl, Bruce W. Steiner, and John T. Herron
Ionization energy determinations
IE (eV) | Method | Reference |
---|---|---|
7.83 ± 0.04 | EI | Nounou, 1966 |
Appearance energy determinations
Ion | AE (eV) | Other Products | Method | Reference | Comment |
---|---|---|---|---|---|
C15H10+ | 16.4 ± 0.2 | ? | EI | Nounou, 1966 | |
C16H12+ | 12.1 ± 0.2 | H2 | EI | Nounou, 1966 | |
C16H13+ | 13.0 ± 0.2 | H | EI | Nounou, 1966 |

References

Weast and Grasselli, 1989
CRC Handbook of Data on Organic Compounds, 2nd Editon, Weast,R.C and Grasselli, J.G., ed(s)., CRC Press, Inc., Boca Raton, FL, 1989, 1. [all data]
Nounou, 1966
Nounou, P.,
Etude des composes aromatiques par spectrometrie de masse. I. Mesure des potentials d'ionisation et d'apparition par la methode du potential retardateur et interpretation des courbes d'ionisation differentielle,
J. Chim. Phys., 1966, 63, 994. [all data]