Phenanthrene, 2,3-dimethyl-
- Formula: C16H14
- Molecular weight: 206.2824
- IUPAC Standard InChIKey: QVRDLHPBZKOROD-UHFFFAOYSA-N
- CAS Registry Number: 3674-65-5
- Chemical structure:
View 3d structure (requires JavaScript / HTML 5) - Other names: 2,3-Dimethyl phenanthrene

Gas phase ion energetics data

Data compiled by: Henry M. Rosenstock, Keith Draxl, Bruce W. Steiner, and John T. Herron
Ionization energy determinations
IE (eV) | Method | Reference |
---|---|---|
7.80 ± 0.03 | EI | Nounou, 1966 |
Appearance energy determinations
Ion | AE (eV) | Other Products | Method | Reference | Comment |
---|---|---|---|---|---|
C15H9+ | 15.6 ± 0.1 | ? | EI | Nounou, 1966 | |
C15H10+ | 15.1 ± 0.1 | ? | EI | Nounou, 1966 | |
C15H11+ | 12.3 ± 0.2 | CH3 | EI | Nounou, 1966 | |
C16H13+ | 13.1 ± 0.1 | H | EI | Nounou, 1966 |

Lee's RI, non-polar column, temperature ramp

Column type | Active phase | I | Reference | Comment |
---|---|---|---|---|
Capillary | DB-5MS | 343.30 | Sun, Zhou, et al., 2008 | 30. m/0.25 mm/0.25 μm, 50. C @ 2. min, 6. K/min, 300. C @ 16. min |
Capillary | HP-5 | 343.92 | Pedersen, Durant, et al., 2005 | 30. m/0.25 mm/0.25 μm, Helium, 50. C @ 1.5 min, 6. K/min, 310. C @ 10. min |
Capillary | CP Sil 8 CB | 344.1 | Bundt, Herbel, et al., 1991 | 50. m/0.25 mm/0.25 μm, He, 4. K/min; Tstart: 80. C; Tend: 300. C |
Capillary | CP Sil 8 CB | 342.90 | Garrigues, Parlanti, et al., 1987 | 50. m/0.22 mm/0.13 μm, H2, 120. C @ 2. min, 3. K/min; Tend: 270. C |

Lee's RI, non-polar column, custom temperature program

Column type | Active phase | I | Reference | Comment |
---|---|---|---|---|
Capillary | DB-5 | 342.46 | Zamperlini, Silva, et al., 1997 | 30. m/0.25 mm/0.25 μm, He; Program: 90C (1min) => 10C/min => 120C => 4C/min => 310C (20min) |
Capillary | CP Sil 8 CB | 342.9 | Bundt, Herbel, et al., 1991 | 50. m/0.25 mm/0.25 μm, He; Program: not specified |
Capillary | CP Sil 8 CB | 343.6 | Bundt, Herbel, et al., 1991 | 50. m/0.25 mm/0.25 μm, He; Program: not specified |

References

Nounou, 1966
Nounou, P.,
Etude des composes aromatiques par spectrometrie de masse. I. Mesure des potentials d'ionisation et d'apparition par la methode du potential retardateur et interpretation des courbes d'ionisation differentielle,
J. Chim. Phys., 1966, 63, 994. [all data]
Sun, Zhou, et al., 2008
Sun, P.; Zhou, Q.; Li, G.; Wang, X.; Zhao, Y.; Cao, L.,
fingerprint analysis of polycyclic aromatic hydrocarbons in crude oil by internal standard method,
J. Instrumental Anal., 2008, 27, 4, 344-348. [all data]
Pedersen, Durant, et al., 2005
Pedersen, D.U.; Durant, J.L.; Taghizadeh, K.; Hemond, H.F.; Lafleur, A.L.; Cass, G.R.,
Human cell mutagenes in respirable airborne particles from the Northeastern United States. 2. Quantification of mutagenes and other organic compounds.,
Environ. Sci. Technol., 2005, 39, 24, 9547-9560, https://doi.org/10.1021/es050886c
. [all data]
Bundt, Herbel, et al., 1991
Bundt, J.; Herbel, W.; Steinhart, H.; Franke, S.; Francke, W.,
Structure-type separation of diesel fuels by solid phase extraction and identification of the two- and three-ring aromatics by capillary GC-mass spectrometry,
J. Hi. Res. Chromatogr., 1991, 14, 2, 91-98, https://doi.org/10.1002/jhrc.1240140205
. [all data]
Garrigues, Parlanti, et al., 1987
Garrigues, P.; Parlanti, E.; Radke, M.; Bellocq, J.; Willsch, H.; Ewald, M.,
Identification of alkylphenanthrenes in shale oil and coal by liquid and capillary gas chromatography and high-resolution spectrofluorimetry (Shpol'skii effect),
J. Chromatogr., 1987, 395, 217-228, https://doi.org/10.1016/S0021-9673(01)94112-3
. [all data]
Zamperlini, Silva, et al., 1997
Zamperlini, G.C.M.; Silva, M.R.S.; Vilegas, W.,
Identification of polycyclic aromatic hydrocarbons in sugar cane soot by gas chromatography-mass spectrometry,
Chromatographia, 1997, 46, 11/12, 655-663, https://doi.org/10.1007/BF02490527
. [all data]