2,4-Difluorophenol
- Formula: C6H4F2O
- Molecular weight: 130.0922
- IUPAC Standard InChIKey: NVWVWEWVLBKPSM-UHFFFAOYSA-N
- CAS Registry Number: 367-27-1
- Chemical structure:
View 3d structure (requires JavaScript / HTML 5) - Other names: Phenol, 2,4-difluoro-

Phase change data

Data compiled as indicated in comments:
BS - Robert L. Brown and Stephen E. Stein
AC - William E. Acree, Jr., James S. Chickos
Quantity | Value | Units | Method | Reference | Comment |
---|---|---|---|---|---|
ΔvapH° | 58.8 ± 0.9 | kJ/mol | C | Ribeiro da Silva and Lobo Ferreira, 2010 | AC |
Reduced pressure boiling point
Tboil (K) | Pressure (bar) | Reference | Comment |
---|---|---|---|
325.7 | 0.025 | Aldrich Chemical Company Inc., 1990 | BS |
325. to 326. | 0.027 | PCR Inc., 1990 | BS |

Gas phase ion energetics data

Data compiled by: Sharon G. Lias, Rhoda D. Levin, and Sherif A. Kafafi
Ionization energy determinations
IE (eV) | Method | Reference | Comment |
---|---|---|---|
8.98 ± 0.02 | PE | Maier, Marthaler, et al., 1980 | Vertical value |

References

Ribeiro da Silva and Lobo Ferreira, 2010
Ribeiro da Silva, Manuel A.V.; Lobo Ferreira, Ana I.M.C.,
Calorimetric and computational thermochemical study of difluorophenol isomers,
The Journal of Chemical Thermodynamics, 2010, 42, 2, 182-188, https://doi.org/10.1016/j.jct.2009.07.011
. [all data]
Aldrich Chemical Company Inc., 1990
Aldrich Chemical Company Inc.,
Catalog Handbook of Fine Chemicals, Aldrich Chemical Company, Inc., Milwaukee WI, 1990, 1. [all data]
PCR Inc., 1990
PCR Inc.,
Research Chemicals Catalog 1990-1991, PCR Inc., Gainesville, FL, 1990, 1. [all data]
Maier, Marthaler, et al., 1980
Maier, J.P.; Marthaler, O.; Mohraz, M.,
Emission spectra of the cations of some fluorosubstituted phenols in the gaseous phase,
J. Electron Spectrosc. Relat. Phenom., 1980, 19, 11. [all data]