Arsine,dimethyl(phenylmethyl)
- Formula: C9H13As
- Molecular weight: 196.1211
- IUPAC Standard InChIKey: LYOBCVROEDSTHT-UHFFFAOYSA-N
- CAS Registry Number: 36678-76-9
- Chemical structure:
View 3d structure (requires JavaScript / HTML 5) - Permanent link for this species. Use this link for bookmarking this species for future reference.

Gas phase ion energetics data

Data compiled by: Sharon G. Lias, Rhoda D. Levin, and Sherif A. Kafafi
Ionization energy determinations
IE (eV) | Method | Reference | Comment |
---|---|---|---|
8.45 | PE | Schmidt, Schweig, et al., 1977 | Vertical value |

References

Schmidt, Schweig, et al., 1977
Schmidt, H.; Schweig, A.; Vermeer, H.,
On the conformation of unsaturated arsines,
J. Mol. Struct., 1977, 37, 93. [all data]