[1,1'-Biphenyl]-4,4'-diamine, N,N,N',N'-tetramethyl-
- Formula: C16H20N2
- Molecular weight: 240.3434
- IUPAC Standard InChIKey: YRNWIFYIFSBPAU-UHFFFAOYSA-N
- CAS Registry Number: 366-29-0
- Chemical structure:
View 3d structure (requires JavaScript / HTML 5) - Other names: Benzidine, N,N,N',N'-tetramethyl-; N,N,N',N'-Tetramethylbenzidine; 4,4'-Bis(N,N-dimethylamino)biphenyl; N,N,N',N'-Tetramethyl-p,p'-benzidine; [1,1'-Biphenyl]-4,4'-diamine,N,N,N'',N'-tetramethyl-

Gas phase ion energetics data

Data compiled as indicated in comments:
LBLHLM - Sharon G. Lias, John E. Bartmess, Joel F. Liebman, John L. Holmes, Rhoda D. Levin, and W. Gary Mallard
LLK - Sharon G. Lias, Rhoda D. Levin, and Sherif A. Kafafi
Ionization energy determinations
IE (eV) | Method | Reference | Comment |
---|---|---|---|
6.40 | PI | Pykhtina, Cherednichenko, et al., 1974 | LLK |
6.84 | PE | Ballard, Jones, et al., 1987 | Vertical value; LBLHLM |

References

Pykhtina, Cherednichenko, et al., 1974
Pykhtina, E.V.; Cherednichenko, L.V.; Kardash, I.E.; Evlasheva, T.I.; Sorokin, V.V.; Potapov, V.K.; Pravednikov, A.N.,
Ionization potentials of amines and energies of charge transfer bands in the absorption spectra of complexes of 7,7,8,8-tetracyanoquinodimethan,
High Energy Chem., 1974, 8, 257, In original 307. [all data]
Ballard, Jones, et al., 1987
Ballard, R.E.; Jones, J.; Read, D.; Inchley, A.; Cranmer, M.,
He(I) photoelectron studies of liquids and gases,
Chem. Phys. Lett., 1987, 137, 125. [all data]
Lang (editor), 1971
Lang (editor), L.,
Absorption Spectra in the Ultraviolet and Visible Region, 1971, 15, 105. [all data]