Dimolybdenum tetrakis(trifluoroacetate)
- Formula: C8F12Mo2O8
- Molecular weight: 643.98
- CAS Registry Number: 36608-07-8

Phase change data

Data compiled as indicated in comments:
MS - José A. Martinho Simões
AC - William E. Acree, Jr., James S. Chickos
Quantity | Value | Units | Method | Reference | Comment |
---|---|---|---|---|---|
ΔsubH° | 27.15 ± 0.41 | kcal/mol | N/A | Carson, 1984 | MS |
Enthalpy of sublimation
ΔsubH (kcal/mol) | Temperature (K) | Method | Reference | Comment |
---|---|---|---|---|
27.15 ± 0.41 | 350. | ME,TE | Carson, 1984, 2 | Based on data from 330. to 370. K.; AC |

Gas phase ion energetics data

Data compiled as indicated in comments:
LBLHLM - Sharon G. Lias, John E. Bartmess, Joel F. Liebman, John L. Holmes, Rhoda D. Levin, and W. Gary Mallard
LLK - Sharon G. Lias, Rhoda D. Levin, and Sherif A. Kafafi
Ionization energy determinations
IE (eV) | Method | Reference | Comment |
---|---|---|---|
8.07 | PE | Bancroft, Pellach, et al., 1982 | LBLHLM |
8.76 | PE | Bancroft, Pellach, et al., 1982 | Vertical value; LBLHLM |
8.67 ± 0.05 | PE | Coleman, Green, et al., 1979 | Vertical value; LLK |

References

Carson, 1984
Carson, A.S.,
J. Chem. Thermodyn., 1984, 16, 427. [all data]
Carson, 1984, 2
Carson, A.S.,
The molar enthalpy of dehydration of Cr2(O2CCH3)4·2H2O(cr) and the molar enthalpies of sublimation of Cr2(O2CCH3)4(cr), Mo2(O2CCH3)4(cr), and Mo2(O2CCF3)4(cr),
The Journal of Chemical Thermodynamics, 1984, 16, 5, 427-429, https://doi.org/10.1016/0021-9614(84)90198-8
. [all data]
Bancroft, Pellach, et al., 1982
Bancroft, G.M.; Pellach, E.; Sattelberger, A.P.; McLaughlin, K.W.,
The photoelectron spectrum of quadruply bonded W2(O2CCF3)4,
J. Chem. Soc., Chem. Commun., 1982, 752. [all data]
Coleman, Green, et al., 1979
Coleman, A.W.; Green, J.C.; Hayes, A.J.; Seddon, E.A.; Lloyd, D.R.; Niwa, Y.,
A comparison of the electronic structure of some group 6A dimetal tetracarboxylates using photoelectron spectroscopy,
J. Chem. Soc. Dalton Trans., 1979, 75, 1057. [all data]