1-Methyl-2,4,5-trioxoimidazolidine
- Formula: C4H4N2O3
- Molecular weight: 128.0862
- IUPAC Standard InChIKey: MJJCZWPYKMGQHU-UHFFFAOYSA-N
- CAS Registry Number: 3659-97-0
- Chemical structure:
View 3d structure (requires JavaScript / HTML 5) - Other names: Methylparabanic acid; Imidazolidinetrione,methyl-

Gas phase ion energetics data

Data compiled by: Sharon G. Lias, Rhoda D. Levin, and Sherif A. Kafafi
Ionization energy determinations
IE (eV) | Method | Reference |
---|---|---|
10.52 | PE | Meeks, Arnett, et al., 1975 |

References

Meeks, Arnett, et al., 1975
Meeks, J.L.; Arnett, J.F.; Larson, D.; McGlynn, S.P.,
Photoelectron spectroscopy of carbonyls. Ionization assignments,
Chem. Phys. Lett., 1975, 30, 190. [all data]