Dimethyl trisulfide
- Formula: C2H6S3
- Molecular weight: 126.264
- IUPAC Standard InChIKey: YWHLKYXPLRWGSE-UHFFFAOYSA-N
- CAS Registry Number: 3658-80-8
- Chemical structure:
View 3d structure (requires JavaScript / HTML 5) - Other names: Trisulfide, dimethyl; Methyl trisulfide; CH3SSSCH3; 2,3,4-Trithiapentane; Dimethyl trisulphide; 1,3-Dimethyltrisulfane; dimethyl trisufide; DMTS

Gas phase ion energetics data

Data compiled as indicated in comments:
LBLHLM - Sharon G. Lias, John E. Bartmess, Joel F. Liebman, John L. Holmes, Rhoda D. Levin, and W. Gary Mallard
RDSH - Henry M. Rosenstock, Keith Draxl, Bruce W. Steiner, and John T. Herron
Ionization energy determinations
IE (eV) | Method | Reference | Comment |
---|---|---|---|
8.73 ± 0.03 | PE | Cullen, Frost, et al., 1969 | RDSH |
8.80 ± 0.15 | EI | Hobrock and Kiser, 1963 | RDSH |
8.85 | PE | Chang, Young, et al., 1986 | Vertical value; LBLHLM |
Appearance energy determinations
Ion | AE (eV) | Other Products | Method | Reference | Comment |
---|---|---|---|---|---|
CHS+ | 14.5 ± 0.3 | ? | EI | Hobrock and Kiser, 1963 | RDSH |
CH2S+ | 13.4 ± 0.3 | ? | EI | Hobrock and Kiser, 1963 | RDSH |
CH3S+ | 12.9 ± 0.2 | ? | EI | Hobrock and Kiser, 1963 | RDSH |
CH3S2+ | 12.3 ± 0.2 | ? | EI | Hobrock and Kiser, 1963 | RDSH |
CH3S3+ | 11.4 ± 0.2 | CH3 | EI | Hobrock and Kiser, 1963 | RDSH |
CH4S2+ | 10.8 ± 0.2 | ? | EI | Hobrock and Kiser, 1963 | RDSH |
S2+ | 14.4 ± 0.3 | ? | EI | Hobrock and Kiser, 1963 | RDSH |

Kovats' RI, non-polar column, isothermal

Column type | Active phase | Temperature (C) | I | Reference | Comment |
---|---|---|---|---|---|
Capillary | OV-101 | 130. | 971. | Misharina and Golovnya, 1989 | He; Column length: 50. m; Column diameter: 0.32 mm |

Kovats' RI, polar column, temperature ramp

Column type | Active phase | I | Reference | Comment |
---|---|---|---|---|
Packed | PEG-20M | 1400. | Galt and MacLeod, 1984 | N2, Celite, 70. C @ 9. min, 10. K/min; Column length: 5.5 m; Tend: 175. C |

Van Den Dool and Kratz RI, non-polar column, temperature ramp

Column type | Active phase | I | Reference | Comment |
---|---|---|---|---|
Capillary | HP-5MS | 972. | Jarunrattanasri, Theerakulkait, et al., 2007 | 30. m/0.25 mm/0.5 μm, He, 35. C @ 5. min, 4. K/min, 225. C @ 30. min |
Capillary | DB-5MS | 978. | Lozano P.R., Drake M., et al., 2007 | 30. m/0.25 mm/0.25 μm, He, 35. C @ 5. min, 10. K/min, 225. C @ 25. min |
Capillary | DB-5MS | 963. | Lozano P.R., Drake M., et al., 2007 | 30. m/0.25 mm/0.25 μm, He, 35. C @ 5. min, 10. K/min, 225. C @ 25. min |
Capillary | DB-5MS | 964. | Lozano P.R., Miracle E.R., et al., 2007 | 30. m/0.25 mm/0.25 μm, He, 35. C @ 5. min, 10. K/min, 225. C @ 25. min |
Capillary | DB-5 | 993. | Mahattanatawee K., Perez-Cacho P.R., et al., 2007 | 30. m/0.32 mm/0.5 μm, He, 7. K/min, 265. C @ 5. min; Tstart: 40. C |
Capillary | DB-5 | 982. | Methven L., Tsoukka M., et al., 2007 | 60. m/0.32 mm/1. μm, 40. C @ 2. min, 4. K/min, 260. C @ 10. min |
Capillary | DB-1 | 943. | Rochat S., de Saint Laumer J.Y., et al., 2007 | 20. m/0.18 mm/0.18 μm, 60. C @ 3. min, 8. K/min, 220. C @ 5. min |
Capillary | DB-1 | 943. | Rochat S., de Saint Laumer J.Y., et al., 2007 | 20. m/0.18 mm/0.18 μm, 60. C @ 3. min, 8. K/min, 220. C @ 5. min |
Capillary | DB-1 | 943. | Rochat S., de Saint Laumer J.Y., et al., 2007 | 20. m/0.18 mm/0.18 μm, 60. C @ 3. min, 8. K/min, 220. C @ 5. min |
Capillary | DB-1 | 943. | Rochat S., de Saint Laumer J.Y., et al., 2007 | 20. m/0.18 mm/0.18 μm, 60. C @ 3. min, 8. K/min, 220. C @ 5. min |
Capillary | ZB-5 | 970. | Ruiz Perez-Cacho, Mahattanatawee, et al., 2007 | 30. m/0.32 mm/0.5 μm, He, 7. K/min, 265. C @ 5. min; Tstart: 40. C |
Capillary | CP Sil 8 CB | 963. | Mahadevan and Farmer, 2006 | 60. C @ 5. min, 4. K/min, 220. C @ 30. min; Column length: 50. m; Column diameter: 0.32 mm |
Capillary | DB-5MS | 973. | Whetstine M.E.C., Drake M.A., et al., 2006 | 30. m/0.25 mm/0.25 μm, He, 40. C @ 5. min, 5. K/min, 200. C @ 45. min |
Capillary | CP Sil 8 CB | 967. | Aliani and Farmer, 2005 | 60. C @ 5. min, 4. K/min, 220. C @ 30. min; Column length: 5. m; Column diameter: 0.32 mm |
Capillary | DB-5MS | 960. | Carunchia Whetstine, Croissant, et al., 2005 | 30. m/0.25 mm/0.25 μm, 40. C @ 3. min, 10. K/min, 200. C @ 20. min |
Capillary | BPX-5 | 982. | Dickschat J.S., Wagner-Dobler I., et al., 2005 | 25. m/0.25 mm/0.25 μm, He, 50. C @ 5. min, 5. K/min; Tend: 300. C |
Capillary | HP-5 | 975. | Solina, Baumgartner, et al., 2005 | 25. m/0.2 mm/1. μm, He, 5. K/min, 280. C @ 5. min; Tstart: 40. C |
Capillary | HP-5 | 975. | Solina, Baumgartner, et al., 2005 | 25. m/0.2 mm/1. μm, He, 5. K/min, 280. C @ 5. min; Tstart: 40. C |
Capillary | DB-5MS | 973. | Whetstine, Cadwallader, et al., 2005 | 30. m/0.25 mm/0.25 μm, 40. C @ 3. min, 10. K/min, 200. C @ 20. min |
Capillary | DB-5 | 970. | Avsar, Karagul-Yuceer, et al., 2004 | 30. m/0.25 mm/0.25 μm, 40. C @ 5. min, 10. K/min, 200. C @ 15. min |
Capillary | BPX-5 | 983. | Dickschat, Wenzel, et al., 2004 | 25. m/0.22 mm/0.25 μm, He, 50. C @ 5. min, 5. K/min; Tend: 300. C |
Capillary | CP-Sil 8CB-MS | 984. | Hierro, de la Hoz, et al., 2004 | 60. m/0.25 mm/0.25 μm, 40. C @ 2. min, 4. K/min, 280. C @ 5. min |
Capillary | DB-5MS | 969. | Karagül-Yüceer, Vlahovich, et al., 2003 | 30. m/0.25 mm/0.25 μm, He, 35. C @ 5. min, 10. K/min, 200. C @ 30. min |
Capillary | DB-5 | 962. | Peterson and Reineccius, 2003 | 30. m/0.25 mm/0.25 μm, 35. C @ 2. min, 4. K/min, 250. C @ 4. min |
Capillary | DB-5 | 962. | Peterson and Reineccius, 2003, 2 | 30. m/0.25 mm/0.25 μm, 35. C @ 2. min, 4. K/min, 250. C @ 4. min |
Capillary | BPX-5 | 992. | Bredie, Mottram, et al., 2002 | 50. m/0.32 mm/0.5 μm, 60. C @ 5. min, 4. K/min, 250. C @ 20. min |
Capillary | CP Sil 8 CB | 984. | Duckham, Dodson, et al., 2002 | 60. m/0.25 mm/0.25 μm, He, 40. C @ 8. min, 4. K/min, 250. C @ 10. min |
Capillary | CP Sil 8 CB | 989. | Duckham, Dodson, et al., 2002 | 60. m/0.25 mm/0.25 μm, He, 40. C @ 8. min, 4. K/min, 250. C @ 10. min |
Capillary | DB-5 | 963. | Karagül-Yüceer, Cadwallader, et al., 2002 | 30. m/0.32 mm/0.25 μm, 35. C @ 5. min, 10. K/min, 200. C @ 30. min |
Capillary | CP Sil 8 CB | 972. | Oruna-Concha, Ames, et al., 2002 | 60. m/0.25 mm/0.25 μm, He, 40. C @ 8. min, 4. K/min, 250. C @ 10. min |
Capillary | DB-5 | 964. | Wu and Cadwallader, 2002 | 30. m/0.32 mm/0.25 μm, He, 40. C @ 5. min, 10. K/min, 220. C @ 30. min |
Capillary | DB-5 | 969. | Zhou, Wintersteen, et al., 2002 | 15. m/0.32 mm/0.5 μm, 30. C @ 2. min, 10. K/min, 225. C @ 20. min |
Capillary | DB-5 | 974. | Zhou, Wintersteen, et al., 2002 | 15. m/0.32 mm/0.5 μm, 30. C @ 2. min, 10. K/min, 225. C @ 20. min |
Capillary | DB-5MS | 966. | Baek, Kim, et al., 2001 | 60. m/0.25 mm/0.25 μm, He, 40. C @ 5. min, 3. K/min, 200. C @ 60. min |
Capillary | DB-1 | 945. | Kim, 2001 | 60. m/0.32 mm/1. μm, He, 40. C @ 5. min, 2. K/min; Tend: 220. C |
Capillary | DB-5MS | 970. | Lee, Suriyaphan, et al., 2001 | 60. m/0.25 mm/0.25 μm, He, 40. C @ 5. min, 2. K/min, 200. C @ 30. min |
Capillary | BPX-5 | 984. | Oruna-Concha, Duckham, et al., 2001 | 50. m/0.32 mm/0.25 μm, He, 35. C @ 3. min, 4. K/min, 250. C @ 10. min |
Capillary | BPX-5 | 984. | Oruna-Concha, Duckham, et al., 2001 | 50. m/0.32 mm/0.25 μm, He, 35. C @ 3. min, 4. K/min, 250. C @ 10. min |
Capillary | BPX-5 | 984. | Oruna-Concha, Duckham, et al., 2001 | 50. m/0.32 mm/0.25 μm, He, 35. C @ 3. min, 4. K/min, 250. C @ 10. min |
Capillary | BPX-5 | 985. | Oruna-Concha, Duckham, et al., 2001 | 50. m/0.32 mm/0.25 μm, He, 35. C @ 3. min, 4. K/min, 250. C @ 10. min |
Capillary | DB-1 | 949. | Pino, Fuentes, et al., 2001 | He, 60. C @ 4. min, 4. K/min; Column length: 30. m; Column diameter: 0.32 mm; Tend: 250. C |
Capillary | DB-5 | 968. | Rychlik and Bosset, 2001 | 30. m/0.053 mm/1.5 μm, He, 6. K/min; Tstart: 0. C; Tend: 230. C |
Capillary | CP Sil 8 CB | 982. | Elmore, Mottram, et al., 2000 | 60. m/0.25 mm/0.25 μm, He, 40. C @ 2. min, 4. K/min; Tend: 280. C |
Capillary | HP-5 | 981. | Song, Sawamura, et al., 2000 | 30. m/0.25 mm/0.25 μm, He, 2. K/min; Tstart: 70. C; Tend: 230. C |
Capillary | CP Sil 8 CB | 963. | Chevance and Farmer, 1999 | 60. C @ 5. min, 4. K/min, 220. C @ 30. min; Column length: 50. m; Column diameter: 0.32 mm |
Capillary | CP Sil 8 CB | 964. | Chevance and Farmer, 1999 | 60. C @ 5. min, 4. K/min, 220. C @ 30. min; Column length: 50. m; Column diameter: 0.32 mm |
Capillary | BPX-5 | 985. | Mandin, Duckham, et al., 1999 | 50. m/0.32 mm/0.25 μm, He, 50. C @ 5. min, 4. K/min, 250. C @ 5. min |
Capillary | BPX-5 | 990. | Mandin, Duckham, et al., 1999 | 50. m/0.32 mm/0.25 μm, He, 50. C @ 5. min, 4. K/min, 250. C @ 5. min |
Capillary | OV-1 | 942. | Valero, Sanz, et al., 1999 | 20. m/0.32 mm/0.3 μm, He, 45. C @ 5. min, 10. K/min, 220. C @ 10. min |
Capillary | BPX-5 | 994. | Aaslyng, Elmore, et al., 1998 | 50. m/0.32 mm/0.50 μm, He, 4. K/min; Tstart: 40. C; Tend: 280. C |
Capillary | DB-5MS | 968. | Cha and Cadwallader, 1998 | 30. m/0.32 mm/0.25 μm, 40. C @ 5. min, 6. K/min, 200. C @ 30. min |
Capillary | SPB-5 | 979. | Verdier-Metz., Coulon, et al., 1998 | 60. m/0.32 mm/1. μm, He, 40. C @ 5. min, 3. K/min, 200. C @ 2. min |
Capillary | DB-1 | 949. | Lee, DeMilo, et al., 1997 | 60. m/0.248 mm/0.25 μm, He, 5. K/min; Tstart: 50. C; Tend: 250. C |
Capillary | DB-1 | 950. | Lee, DeMilo, et al., 1997 | 60. m/0.248 mm/0.25 μm, He, 5. K/min; Tstart: 50. C; Tend: 250. C |
Capillary | DB-1 | 950. | Lee, DeMilo, et al., 1997 | 60. m/0.248 mm/0.25 μm, He, 5. K/min; Tstart: 50. C; Tend: 250. C |
Capillary | RTX-5 | 972. | Milo and Reineccius, 1997 | 30. m/0.53 mm/1.5 μm, 0. C @ 1. min, 8. K/min; Tend: 250. C |
Capillary | DB-1 | 940. | DeMilo, Lee, et al., 1996 | 30. m/0.248 mm/0.25 μm, He, 50. C @ 5. min, 5. K/min; Tend: 250. C |
Capillary | DB-1 | 940. | DeMilo, Lee, et al., 1996 | 30. m/0.248 mm/0.25 μm, He, 50. C @ 5. min, 5. K/min; Tend: 250. C |
Capillary | DB-5 | 970. | Kim, Wu, et al., 1995 | He, 40. C @ 10. min, 4. K/min; Column length: 60. m; Column diameter: 0.25 mm; Tend: 200. C |
Capillary | DB-1 | 944. | Specht and Baltes, 1994 | 60. m/0.25 mm/0.25 μm, 35. C @ 10. min, 2. K/min, 280. C @ 10. min |
Capillary | DB-1 | 957. | Yu, Lin, et al., 1994 | 60. m/0.25 mm/1.0 μm, He, 40. C @ 5. min, 2. K/min, 260. C @ 60. min |
Capillary | Ultra-1 | 937.4 | Farkas, Hradský, et al., 1992 | 25. m/0.2 mm/0.33 μm, H2, 2. K/min; Tstart: 60. C; Tend: 230. C |
Capillary | HP-1 | 945. | Kuo and Ho, 1992 | 50. m/0.32 mm/1.05 μm, He, 2. K/min; Tstart: 40. C; Tend: 260. C |
Capillary | HP-1 | 949. | Kuo and Ho, 1992, 2 | 50. m/0.32 mm/1.05 μm, He, 2. K/min; Tstart: 40. C; Tend: 260. C |
Capillary | HP-1 | 958. | Zhang, Dorjpalam, et al., 1992 | 50. m/0.32 mm/1.5 μm, 2. K/min, 220. C @ 30. min; Tstart: 40. C |
Capillary | DB-1 | 949. | Izzo and Ho, 1991 | 50. m/0.32 mm/1.05 μm, He, 2. K/min, 260. C @ 40. min; Tstart: 40. C |
Capillary | OV-101 | 948. | Misharina and Golovnya, 1989 | He, 4. K/min; Column length: 50. m; Column diameter: 0.32 mm; Tstart: 50. C; Tend: 250. C |
Capillary | OV-1 | 949. | Chen and Ho, 1986 | H2, 4. K/min, 280. C @ 50. min; Column length: 50. m; Column diameter: 0.2 mm; Tstart: 50. C |
Capillary | OV-1 | 950. | Schreyen, Dirinck, et al., 1976 | 1. K/min; Column length: 183. m; Column diameter: 0.762 mm; Tstart: 0. C; Tend: 230. C |
Capillary | OV-1 | 948. | Schreyen, Dirinck, et al., 1976, 2 | N2, 1. K/min; Column length: 183. m; Tstart: 0. C; Tend: 230. C |

Van Den Dool and Kratz RI, non-polar column, custom temperature program

Column type | Active phase | I | Reference | Comment |
---|---|---|---|---|
Capillary | HP-5MS | 977.2 | Andriamaharavo, 2014 | 30. m/0.25 mm/0.25 μm, He; Program: 60C (1 min) => 5 C/min => 210C => 10 C/min => 280C (15 min) |
Capillary | SPB-5 | 961. | Majcher and Jelen, 2007 | 30. m/0.53 mm/1.5 μm; Program: 40C(1min) => 6C/min => 180C => 20C/min => 280C |
Capillary | SE-54 | 961. | Frauendorfer and Schieberle, 2006 | 25. m/0.32 mm/0.25 μm, He; Program: 40C(1min) => 40C/min => 60C(1min) => 4C/min => 140C => 20C/min => 240C(5min) |
Capillary | HP-5MS | 956. | Bonaiti, Irlinger, et al., 2005 | 30. m/0.25 mm/0.25 μm, He; Program: 5C(8min) => 3C/min => 20C => 10C/min => 150C(10min) |
Capillary | DB-5 | 961. | Majcher and Jelén, 2005 | 30. m/0.25 mm/0.25 μm, He; Program: 40C(1min) => 6C/min => 180C => 20C/min => 280C |
Capillary | DB-5 | 979. | Klesk and Qian, 2003 | 30. m/0.25 mm/0.25 μm, He; Program: 40C(2min) => 5C/min => 100C => 4C/min => 230C(10min) |
Capillary | DB-5 | 964. | Klesk and Qian, 2003, 2 | 30. m/0.32 mm/1. μm, He; Program: 40C(2min) => 2C/min => 100C => 10C/min => 230C (5min) |
Capillary | BPX-5 | 978. | Byrne, Bredie, et al., 2002 | 50. m/0.25 mm/0.25 μm, He; Program: 0C (5min) => 40C/min => 40C (2min) => 4C/min => 280C |
Capillary | HP-5 | 954. | Carrapiso, Ventanas, et al., 2002 | 50. m/0.32 mm/1.05 μm; Program: 35C(5min) => 10C/min => 150C => 20C/min => 250C(10 min) |
Capillary | HP-5 | 954. | Engel, Baty, et al., 2002 | 30. m/0.25 mm/0.25 μm, He; Program: 5C(5min) => 3C/min => 20C => 5C/min => 100C 15C/min => 150C (5min) |
Capillary | DB-5 | 965. | Kirchhoff and Schieberle, 2002 | 25. m/0.32 mm/0.25 μm, He; Program: 35C (2min) => 40C/min => 50C (2min) => 4C/min => 240C (10min) |
Capillary | CP Sil 8 CB | 976. | Oruna-Concha, Bakker, et al., 2002 | 60. m/0.25 mm/0.25 μm, He; Program: 0C => rapidly => 40C(8min) => 4C/min => 250C(10min) |
Capillary | DB-5 | 961. | Zehentbauer and Reineccius, 2002 | 30. m/0.25 mm/0.25 μm, He; Program: 35 C (2 min) 40 C/min -> 50 C (2 min) 4 C/min -> 230 C |
Capillary | CP Sil 8 CB | 980. | Duckham, Dodson, et al., 2001 | 60. m/0.25 mm/0.25 μm; Program: 0C => rapidly => 40C(8min) => 4C/min => 250C(10min) |
Capillary | DB-5 | 965. | Kirchhoff and Schieberle, 2001 | 25. m/0.32 mm/0.25 μm, He; Program: 35C(2min) => 40C/min => 50C(2min) => 4C/min => 240C(10min) |
Capillary | CP Sil 8 CB | 989. | Martin and Ames, 2001 | 60. m/0.25 mm/0.25 μm, He; Program: 40C(2min) => 4C/min => 200C => 10C/min => 250C(15min) |
Capillary | CP-Sil8 | 989. | Martin and Ames, 2001, 2 | 60. m/0.25 mm/0.25 μm, He; Program: 40C(2min) => 4C/min => 200C => 10C/min => 250C (15min) |
Capillary | DB-5 | 964. | Rychlik and Bosset, 2001 | 30. m/0.32 mm/0.25 μm, He; Program: 35C(2min) => 40C/min => 60C (2min) => 4C/min => 240C |
Capillary | CP-Sil 8CB-MS | 979. | Elmore, Mottram, et al., 2000, 2 | 60. m/0.25 mm/0.25 μm, He; Program: 0C(5min) => 40C/min => 40C (2min) => 4C/min => 280C |
Capillary | DB-1 | 947. | Eri, Khoo, et al., 2000 | 60. m/0.25 mm/0.25 μm, He; Program: -20C (5min) => 10C/min => 100C => 4C/min => 200C => 10C/min => 280C |
Capillary | DB-5 | 966. | Munk, Munch, et al., 2000 | 30. m/0.32 mm/0.25 μm; Program: 40C(2min) => 40C/min => 50C (1min) => 6C/min => 180C => 10C/min => 240C (5min) |
Capillary | DB-5 | 968. | Munk, Munch, et al., 2000 | 30. m/0.32 mm/0.25 μm; Program: 40C(2min) => 40C/min => 50C (1min) => 6C/min => 180C => 10C/min => 240C (5min) |
Capillary | SE-54 | 971. | Tairu, Hofmann, et al., 2000 | 30. m/0.32 mm/0.25 μm, He; Program: 35C (2min) => 40C/min => 60C (2min) => 6C/min => 180C (5min) => 10C/min => 230C (5min) |
Capillary | BPX-5 | 982. | Elmore, Mottram, et al., 1999 | 50. m/0.32 mm/0.5 μm, He; Program: 0C(5min) => 40C/min => 40C(2min) => 4C/min => 280C |
Capillary | SE-54 | 968. | Mutti and Grosch, 1999 | 60. m/0.32 mm/0.25 μm, He; Program: 40C(2min) => 5C/min => 70C(2min) => 6C/min => 250C(10min) |
Capillary | RTX-5 | 971. | Mutti and Grosch, 1999 | Program: not specified |
Capillary | BPX-5 | 990. | Bredie, Mottram, et al., 1998 | 50. m/0.32 mm/0.5 μm, He; Program: OC (5min) => 60C/min => 60C(5min) => 4C/min => 250C |
Capillary | SE-54 | 973. | Fickert and Schieberle, 1998 | 25. m/0.32 mm/0.5 μm, He; Program: 35C (2min) => 4C/min => 150C => 10C/min => 240C |
Capillary | SE-54 | 963. | Fickert and Schieberle, 1998 | 25. m/0.32 mm/0.5 μm, He; Program: 35C (2min) => 4C/min => 150C => 10C/min => 240C |
Capillary | SPB-1 | 946. | Mochizuki, Yamamoto, et al., 1998 | 30. m/0.32 mm/4.0 μm, N2; Program: 40 0C (10 min), 2 0C/min to 180 0C, 25 0C/min to 250 0C (5 min) |
Capillary | RTX-5 | 970. | Heiler and Schieberle, 1997 | 30. m/0.53 mm/1. μm; Program: not specified |
Capillary | SE-54 | 968. | Kubícková and Grosch, 1997 | Column length: 30. m; Column diameter: 0.32 mm; Program: 35C (2min) => 40C/min => 50C (2min) => 4C/min => 250C (10min) |
Capillary | SE-54 | 970. | Kubícková and Grosch, 1997 | Column length: 30. m; Column diameter: 0.32 mm; Program: 35C (2min) => 40C/min => 50C (2min) => 4C/min => 250C (10min) |
Capillary | DB-5 | 968. | Beal and Mottram, 1994 | 30. m/0.32 mm/1.0 μm, He; Program: 5 0C (0.5 min) -> (1 min) 60 0C (5 min) 4 0C/min -> 250 0C |

Van Den Dool and Kratz RI, polar column, temperature ramp

Column type | Active phase | I | Reference | Comment |
---|---|---|---|---|
Capillary | DB-FFAP | 1381. | Jarunrattanasri, Theerakulkait, et al., 2007 | 30. m/0.25 mm/0.5 μm, He, 35. C @ 5. min, 4. K/min, 225. C @ 30. min |
Capillary | FFAP | 1373. | Lozano P.R., Drake M., et al., 2007 | 30. m/0.25 mm/0.25 μm, He, 35. C @ 5. min, 10. K/min, 225. C @ 25. min |
Capillary | FFAP | 1376. | Lozano P.R., Drake M., et al., 2007 | 30. m/0.25 mm/0.25 μm, He, 35. C @ 5. min, 10. K/min, 225. C @ 25. min |
Capillary | FFAP | 1387. | Lozano P.R., Miracle E.R., et al., 2007 | 30. m/0.25 mm/0.25 μm, He, 35. C @ 5. min, 10. K/min, 225. C @ 25. min |
Capillary | DB-Wax | 1383. | Mahattanatawee K., Perez-Cacho P.R., et al., 2007 | 30. m/0.32 mm/0.5 μm, He, 7. K/min, 240. C @ 5. min; Tstart: 40. C |
Capillary | DB-Wax | 1370. | Pozo-Bayon M.A., Ruiz-Rodriguez A., et al., 2007 | 30. m/0.25 mm/0.5 μm, He, 40. C @ 5. min, 4. K/min, 250. C @ 15. min |
Capillary | DB-Wax | 1377. | Pozo-Bayon M.A., Ruiz-Rodriguez A., et al., 2007 | 30. m/0.25 mm/0.5 μm, He, 40. C @ 5. min, 4. K/min, 250. C @ 15. min |
Capillary | DB-Wax | 1385. | Ruiz Perez-Cacho, Mahattanatawee, et al., 2007 | 30. m/0.32 mm/0.5 μm, He, 7. K/min, 240. C @ 5. min; Tstart: 40. C |
Capillary | DB-Wax | 1378. | Fernandez-Segovia, Escriche, et al., 2006 | 30. m/0.25 mm/0.25 μm, He, 50. C @ 5. min, 10. K/min, 230. C @ 25. min |
Capillary | DB-Wax | 1390. | Lopez-Galilea I., Fournier N., et al., 2006 | 30. m/0.32 mm/0.5 μm, He, 5. K/min, 240. C @ 10. min; Tstart: 40. C |
Capillary | CP-Wax 52CB | 1373. | Mahadevan and Farmer, 2006 | 60. C @ 5. min, 4. K/min, 220. C @ 30. min; Column length: 50. m; Column diameter: 0.32 mm |
Capillary | CP-Wax 52CB | 1375. | Mahadevan and Farmer, 2006 | 60. C @ 5. min, 4. K/min, 220. C @ 30. min; Column length: 50. m; Column diameter: 0.32 mm |
Capillary | CP-Wax 52CB | 1361. | Mahadevan and Farmer, 2006 | 60. C @ 5. min, 4. K/min, 220. C @ 30. min; Column length: 50. m; Column diameter: 0.32 mm |
Capillary | CP-Wax 52CB | 1375. | Alasalvar, Taylor, et al., 2005 | 60. m/0.25 mm/0.25 μm, 35. C @ 4. min, 3. K/min; Tend: 203. C |
Capillary | DB-Wax | 1362. | Carunchia Whetstine, Croissant, et al., 2005 | 30. m/0.25 mm/0.25 μm, 40. C @ 3. min, 10. K/min, 200. C @ 20. min |
Capillary | Stabilwax | 1404. | Fang and Qian, 2005 | 30. m/0.32 mm/1. μm, N2, 40. C @ 2. min, 4. K/min, 230. C @ 10. min |
Capillary | Carbowax 20M | 1357. | Verzera, Campisi, et al., 2005 | 60. m/0.25 mm/0.25 μm, He, 45. C @ 0.17 min, 2. K/min; Tend: 250. C |
Capillary | DB-Wax | 1362. | Whetstine, Cadwallader, et al., 2005 | 30. m/0.25 mm/0.25 μm, 40. C @ 3. min, 10. K/min, 200. C @ 20. min |
Capillary | DB-FFAP | 1386. | Avsar, Karagul-Yuceer, et al., 2004 | 15. m/0.32 mm/0.25 μm, He, 35. C @ 5. min, 10. K/min, 225. C @ 15. min |
Capillary | DB-Wax | 1365. | Avsar, Karagul-Yuceer, et al., 2004 | 30. m/0.25 mm/0.25 μm, 40. C @ 5. min, 10. K/min, 200. C @ 15. min |
Capillary | DB-FFAP | 1371. | Avsar, Karagul-Yuceer, et al., 2004 | 15. m/0.32 mm/0.25 μm, He, 35. C @ 5. min, 10. K/min, 225. C @ 15. min |
Capillary | FFAP | 1369. | Calvo-Gómez, Morales-López, et al., 2004 | 30. m/0.25 mm/0.25 μm, He, 40. C @ 3. min, 5. K/min; Tend: 220. C |
Capillary | DB-Wax | 1367. | Mahajan, Goddik, et al., 2004 | 30. m/0.25 mm/0.5 μm, He, 40. C @ 2. min, 5. K/min, 230. C @ 10. min |
Capillary | DB-Wax | 1376. | Nielsen, Larsen, et al., 2004 | 30. m/0.25 mm/0.25 μm, He, 45. C @ 10. min, 6. K/min, 240. C @ 30. min |
Capillary | DB-Wax | 1356. | Nielsen and Poll, 2004 | 30. m/0.25 mm/0.25 μm, He, 45. C @ 10. min, 3. K/min, 240. C @ 30. min |
Capillary | DB-FFAP | 1367. | Karagül-Yüceer, Vlahovich, et al., 2003 | 30. m/0.25 mm/0.25 μm, He, 35. C @ 5. min, 10. K/min, 200. C @ 30. min |
Capillary | DB-Wax | 1376. | Nielsen, Larsen, et al., 2003 | 30. m/0.25 mm/0.25 μm, He, 40. C @ 10. min, 6. K/min, 240. C @ 30. min |
Capillary | DB-Wax | 1380. | Peterson and Reineccius, 2003 | 30. m/0.25 mm/0.25 μm, 35. C @ 2. min, 6. K/min, 240. C @ 6. min |
Capillary | Carbowax | 1380. | Edris and Fadel, 2002 | He, 2. K/min; Column length: 60. m; Column diameter: 0.32 mm; Tstart: 50. C; Tend: 200. C |
Capillary | DB-Wax | 1360. | Karagül-Yüceer, Cadwallader, et al., 2002 | 30. m/0.25 mm/0.25 μm, 35. C @ 5. min, 10. K/min, 200. C @ 30. min |
Capillary | DB-FFAP | 1352. | Karagül-Yüceer, Cadwallader, et al., 2002 | 30. m/0.25 mm/0.25 μm, 35. C @ 5. min, 10. K/min, 200. C @ 30. min |
Capillary | DB-Wax | 1380. | Wu and Cadwallader, 2002 | 30. m/0.53 mm/1. μm, He, 40. C @ 5. min, 10. K/min, 200. C @ 30. min |
Capillary | DB-FFAP | 1359. | Zhou, Wintersteen, et al., 2002 | 15. m/0.32 mm/0.25 μm, 30. C @ 2. min, 10. K/min, 225. C @ 20. min |
Capillary | DB-FFAP | 1359. | Zhou, Wintersteen, et al., 2002 | 15. m/0.32 mm/0.25 μm, 30. C @ 2. min, 10. K/min, 225. C @ 20. min |
Capillary | EC-WAX | 1390. | le Guen, Prost, et al., 2001 | 30. m/0.32 mm/0.5 μm, He, 40. C @ 2. min, 5. K/min, 250. C @ 10. min |
Capillary | DB-Wax | 1368. | Kim, 2001 | 60. m/0.25 mm/0.25 μm, He, 40. C @ 5. min, 2. K/min, 200. C @ 30. min |
Capillary | DB-Wax | 1381. | Lee, Suriyaphan, et al., 2001 | 60. m/0.25 mm/0.25 μm, He, 2. K/min; Tstart: 40. C; Tend: 200. C |
Capillary | DB-Wax | 1381. | Lee, Suriyaphan, et al., 2001 | 60. m/0.25 mm/0.25 μm, He, 2. K/min; Tstart: 40. C; Tend: 200. C |
Capillary | CP-Wax 52CB | 1370. | Liu, Yang, et al., 2001 | H2, 2. K/min; Column length: 50. m; Column diameter: 0.32 mm; Tstart: 50. C; Tend: 200. C |
Capillary | CP-Wax 52CB | 1357. | Verzera, Campisi, et al., 2001 | 60. m/0.25 mm/0.25 μm, He, 45. C @ 0.17 min, 2. K/min; Tend: 250. C |
Capillary | CP-Wax 52CB | 1356. | Chevance, Farmer, et al., 2000 | 60. C @ 5. min, 4. K/min, 220. C @ 30. min; Column length: 50. m; Column diameter: 0.32 mm |
Capillary | DB-Wax | 1391. | le Guen, Prost, et al., 2000 | 60. m/0.32 mm/0.5 μm, He, 40. C @ 5. min, 3. K/min, 250. C @ 10. min |
Capillary | DB-Wax | 1394. | Le Guen, Prost, et al., 2000 | 60. m/0.32 mm/0.5 μm, He, 40. C @ 2. min, 4. K/min, 250. C @ 10. min |
Capillary | DB-Wax | 1390. | Le Guen, Prost, et al., 2000 | 60. m/0.32 mm/0.5 μm, He, 40. C @ 2. min, 4. K/min, 250. C @ 10. min |
Capillary | CP-Wax 52CB | 1359. | Chevance and Farmer, 1999 | 60. C @ 5. min, 4. K/min, 220. C @ 30. min; Column length: 50. m; Column diameter: 0.32 mm |
Capillary | CP-Wax 52CB | 1376. | Chevance and Farmer, 1999 | 60. C @ 5. min, 4. K/min, 220. C @ 30. min; Column length: 50. m; Column diameter: 0.32 mm |
Capillary | CP-Wax 52CB | 1357. | Chevance and Farmer, 1999, 2 | 40. C @ 5. min, 4. K/min, 220. C @ 30. min; Column length: 50. m; Column diameter: 0.32 mm |
Capillary | CP-Wax 52CB | 1373. | Chevance and Farmer, 1999, 2 | 40. C @ 5. min, 4. K/min, 220. C @ 30. min; Column length: 50. m; Column diameter: 0.32 mm |
Capillary | Supelcowax-10 | 1386. | Chung, 1999 | 60. m/0.25 mm/0.25 μm, He, 35. C @ 5. min, 2. K/min, 195. C @ 90. min |
Capillary | DB-Wax | 1366. | Cha and Cadwallader, 1998 | 30. m/0.32 mm/0.25 μm, 40. C @ 5. min, 6. K/min, 200. C @ 30. min |
Capillary | DB-Wax | 1379. | Cha, Kim, et al., 1998 | 60. m/0.25 mm/0.25 μm, 40. C @ 5. min, 3. K/min, 200. C @ 60. min |
Capillary | DB-Wax | 1365. | Cha, Kim, et al., 1998 | 30. m/0.32 mm/0.25 μm, He, 40. C @ 5. min, 6. K/min, 200. C @ 30. min |
Capillary | FFAP | 1405. | Ott, Fay, et al., 1997 | 30. m/0.25 mm/0.25 μm, He, 20. C @ 1. min, 4. K/min, 200. C @ 1. min |
Capillary | DB-Wax | 1403. | Ott, Fay, et al., 1997 | 60. m/0.53 mm/1. μm, He, 20. C @ 5. min, 4. K/min, 200. C @ 10. min |
Capillary | DB-Wax | 1406. | Ott, Fay, et al., 1997 | 60. m/0.53 mm/1. μm, He, 20. C @ 5. min, 4. K/min, 200. C @ 10. min |
Capillary | DB-Wax | 1406. | Ott, Fay, et al., 1997 | 60. m/0.53 mm/1. μm, He, 20. C @ 5. min, 4. K/min, 200. C @ 10. min |
Capillary | DB-Wax | 1387. | Shimoda, Peralta, et al., 1996 | 60. m/0.25 mm/0.25 μm, He, 3. K/min; Tstart: 50. C; Tend: 230. C |
Capillary | CP-Wax 52CB | 1380. | Kim, Wu, et al., 1995, 2 | N2, 60. C @ 4. min, 2. K/min, 200. C @ 30. min; Column length: 50. m; Column diameter: 0.25 mm |
Capillary | CP-Wax 52CB | 1380. | Kim, Wu, et al., 1995, 2 | N2, 60. C @ 4. min, 2. K/min, 200. C @ 30. min; Column length: 50. m; Column diameter: 0.25 mm |
Capillary | Supelcowax-10 | 1382. | Chung and Cadwallader, 1993 | 60. m/0.25 mm/0.25 μm, He, 40. C @ 5. min, 2. K/min, 195. C @ 40. min |
Capillary | CP-Wax 52CB | 1329. | Yu, Wu, et al., 1993 | 50. m/0.32 mm/0.25 μm, H2, 40. C @ 10. min, 1.5 K/min, 200. C @ 60. min |
Capillary | Supelcowax-10 | 1387. | Tanchotikul and Hsieh, 1989 | 60. m/0.25 mm/0.25 μm, 40. C @ 5. min, 2. K/min, 175. C @ 20. min |
Capillary | Supelcowax-10 | 1388. | Tanchotikul and Hsieh, 1989 | 60. m/0.25 mm/0.25 μm, 40. C @ 5. min, 2. K/min, 175. C @ 20. min |
Capillary | CP-Wax 52CB | 1380. | Yu, Wu, et al., 1989 | N2, 2. K/min; Column length: 50. m; Column diameter: 0.22 mm; Tstart: 50. C; Tend: 200. C |
Capillary | Supelcowax-10 | 1389. | Vejaphan, Hsieh, et al., 1988 | 60. m/0.25 mm/0.25 μm, 40. C @ 5. min, 2. K/min, 175. C @ 20. min |

Van Den Dool and Kratz RI, polar column, custom temperature program

Column type | Active phase | I | Reference | Comment |
---|---|---|---|---|
Capillary | Supelcowax-10 | 1383. | Bianchi, Careri, et al., 2007 | 30. m/0.25 mm/0.25 μm, He; Program: 35C(8min) => 4C/min => 60C => 6C/min => 160C => 20C/min => 200C(1min) |
Capillary | Supelcowax-10 | 1381. | Bianchi, Careri, et al., 2007 | 30. m/0.25 mm/0.25 μm, He; Program: 35C(8min) => 4C/min => 60C => 6C/min => 160C => 20C/min => 200C(1min) |
Capillary | Supelcowax-10 | 1347. | Majcher and Jelen, 2007 | 30. m/0.25 mm/0.25 μm; Program: 40C(2min) => 40C/min => 60C(2min) => 5C/min => 240C |
Capillary | FFAP | 1332. | Frauendorfer and Schieberle, 2006 | 25. m/0.32 mm/0.2 μm, He; Program: 40C(1min) => 40C/min => 60C(1min) => 6C/min => 180C => 15C/min => 240C |
Capillary | DB-Wax | 1363. | Hallier, Prost, et al., 2005 | 30. m/0.32 mm/0.5 μm, He; Program: 40C(5min) => 10C/min => 160C => 15C/min => 230C |
Capillary | Supelcowax-10 | 1377. | Majcher and Jelén, 2005 | 30. m/0.25 mm/0.25 μm, He; Program: 40C(2min) => 40C/min => 60(2min)C => 5C/min => 240C |
Capillary | FFAP | 1415. | Ranau and Steinhart, 2005 | 60. m/0.25 mm/0.5 μm, He; Program: 50C(3min) => 3C/min => 100C => 10C/min => 220C (13.5min) |
Capillary | Stabilwax | 1383. | Klesk and Qian, 2003 | 30. m/0.32 mm/1. μm, He; Program: 40C(2min) => 5C/min => 100C => 4C/min => 230C(10min) |
Capillary | DB-Wax | 1377. | Klesk and Qian, 2003, 2 | 30. m/0.25 mm/0.5 μm, He; Program: 40C(2min) => 2C/min => 100C => 10C/min => 230C (5min) |
Capillary | FFAP | 1372. | Kirchhoff and Schieberle, 2002 | 30. m/0.32 mm/0.25 μm, He; Program: 35C (2min) => 60C/min => 50C (2min) => 6C/min => 240C (10min) |
Capillary | FFAP | 1372. | Kirchhoff and Schieberle, 2001 | 30. m/0.32 mm/0.25 μm, He; Program: 40C(2min) => 40C/min => 60C(2min) => 6C/min => 240C(10min) |
Capillary | DB-FFAP | 1367. | Munk, Johansen, et al., 2001 | 30. m/0.32 mm/0.25 μm; Program: 40C(2min) => 40C/min => 60C (2min) => 6C/min => 180C => 10C/min => 240C(5min) |
Capillary | DB-FFAP | 1340. | Munk, Munch, et al., 2000 | 30. m/0.32 mm/0.25 μm; Program: 40C(2min) => 40C/min => 60C (2min) => 6C/min => 180C => 10C/min => 240C (5min) |
Capillary | DB-FFAP | 1343. | Munk, Munch, et al., 2000 | 30. m/0.32 mm/0.25 μm; Program: 40C(2min) => 40C/min => 60C (2min) => 6C/min => 180C => 10C/min => 240C (5min) |
Capillary | FFAP | 1375. | Tairu, Hofmann, et al., 2000 | 30. m/0.32 mm/0.25 μm, He; Program: 35C (2min) => 40C/min => 60C (2min) => 6C/min => 180C (5min) => 10C/min => 230C (5min) |
Capillary | EC-WAX | 1390. | Boatright and Lei, 1999 | 30. m/0.32 mm/0.25 μm, He |
Capillary | EC-WAX | 1387. | Boatright and Lei, 1999 | 30. m/0.32 mm/0.25 μm, He; Program: 40C(5min) => 3C/min => 165C => 20C/min => 220C |
Capillary | DB-FFAP | 1368. | Mutti and Grosch, 1999 | 30. m/0.32 mm/0.25 μm, He; Program: 40C(2min) => 40C/min => 60C(2min) => 6C/min => 230C(10min) |
Capillary | FFAP | 1383. | Fickert and Schieberle, 1998 | 25. m/0.32 mm/0.5 μm, He; Program: 35C (2min) => 40C/min => 60C => 6C/min => 230C (10min) |
Capillary | Supelcowax-10 | 1380. | Baek and Cadwallader, 1996 | 60. m/0.25 mm/0.25 μm; Program: 40C => (6C/min) => 80C(6min) => (15C/min) => 200C(10min) |
Capillary | FFAP | 1356. | Hofmann and Schieberle, 1995 | 30. m/0.32 mm/0.25 μm, He; Program: 40C (2min) => 40C/min => 60C (5min) => 6C/min => 230C (15min) |
Capillary | BP-20 | 1410. | Beal and Mottram, 1994 | 50. m/0.32 mm/0.5 μm, He; Program: 5 0C (0.5 min) -> (1 min) 60 0C (5 min) 4 0C/min -> 200 0C |
Capillary | FFAP | 1372. | Yasuhara, 1987 | 50. m/0.25 mm/0.25 μm, He; Program: 20C (5min) => 2C/min => 70C => 4C/min => 210C |

Normal alkane RI, non-polar column, isothermal

Column type | Active phase | Temperature (C) | I | Reference | Comment |
---|---|---|---|---|---|
Packed | SE-30 (10 %) + CW-20M (1 %) | 112. | 972. | Hillen and Werner, 1973 | Nitrogen, Chromosorb W DCMS (100-120 mesh); Column length: 2. m |
Packed | SE-30 (10 %) + CW-20M (1 %) | 50. | 932. | Hillen and Werner, 1973 | Nitrogen, Chromosorb W DCMS (100-120 mesh); Column length: 2. m |

Normal alkane RI, non-polar column, temperature ramp

Column type | Active phase | I | Reference | Comment |
---|---|---|---|---|
Capillary | Optima-5 MS | 971. | Goeminne, Vandendriessche, et al., 2012 | 30. m/0.25 mm/0.25 μm, Helium, 35. C @ 3. min, 10. K/min, 250. C @ 5. min |
Capillary | HP-5 MS | 962. | Kotowska, Zalikowski, et al., 2012 | 30. m/0.25 mm/0.25 μm, Helium, 35. C @ 5. min, 3. K/min, 300. C @ 15. min |
Capillary | HP-5 MS | 969. | Nawrath, Mgode, et al., 2012 | 30. m/0.25 mm/0.25 μm, Helium, 50. C @ 5. min, 5. K/min; Tend: 320. C |
Capillary | VF-5 MS | 968. | Leffingwell and Alford, 2011 | 60. m/0.32 mm/0.25 μm, Helium, 2. K/min, 260. C @ 28. min; Tstart: 30. C |
Capillary | VF-5 MS | 972. | Leffingwell and Alford, 2011 | 60. m/0.32 mm/0.25 μm, Helium, 2. K/min, 260. C @ 28. min; Tstart: 30. C |
Capillary | HP-5 MS | 969. | Pino, Marquez, et al., 2010 | 30. m/0.32 mm/0.25 μm, Helium, 50. C @ 2. min, 4. K/min, 240. C @ 10. min |
Capillary | DB-5 MS | 966. | Chen, Song, et al., 2009 | 30. m/0.32 mm/0.25 μm, Helium, 40. C @ 2. min, 6. K/min, 230. C @ 20. min |
Capillary | DB-5 MS | 975. | Chen, Song, et al., 2009 | 30. m/0.32 mm/0.25 μm, Helium, 40. C @ 2. min, 6. K/min, 250. C @ 20. min |
Capillary | HP-101 | 969. | Blazevic and Mastelic, 2008 | 25. m/0.20 mm/0.25 μm, Helium, 70. C @ 2. min, 3. K/min; Tend: 200. C |
Capillary | HP-101 | 969. | Blazevic and Mastelic, 2008 | 25. m/0.20 mm/0.25 μm, Helium, 70. C @ 2. min, 3. K/min; Tend: 200. C |
Capillary | HP-1 | 943. | Breme, Langle, et al., 2008 | 50. m/0.20 mm/0.33 μm, Helium, 2. K/min, 250. C @ 20. min; Tstart: 60. C |
Capillary | HP-1 | 946. | Breme, Langle, et al., 2008 | 50. m/0.20 mm/0.33 μm, Helium, 2. K/min, 250. C @ 20. min; Tstart: 60. C |
Capillary | RTX-5 | 971. | Pham, Schilling, et al., 2008 | 30. m/0.25 mm/0.25 μm, He, 40. C @ 5. min, 20. K/min; Tend: 250. C |
Capillary | SPB-1 | 935. | Rao, Nagender, et al., 2007 | 30. m/0.32 mm/0.25 μm, Helium, 40. C @ 2. min, 2. K/min; Tend: 220. C |
Capillary | DB-5 | 976. | Fan and Qian, 2006 | 30. m/0.32 mm/1. μm, He, 40. C @ 2. min, 4. K/min, 250. C @ 15. min |
Capillary | DB-1 | 934. | Iranshahi, Amin, et al., 2006 | 30. m/0.25 mm/0.25 μm, He, 50. C @ 1. min, 2.5 K/min, 265. C @ 20. min |
Capillary | HP-1 | 957. | Bendimerad and Bendiab, 2005 | 50. m/0.2 mm/0.5 μm, He, 2. K/min, 250. C @ 60. min; Tstart: 60. C |
Capillary | BPX5 | 983. | Dickschat, Bode, et al., 2005 | 25. m/0.22 mm/0.25 μm, Helium, 50. C @ 5. min, 5. K/min; Tend: 320. C |
Capillary | BPX-5 | 981. | Dickschat, Martens, et al., 2005 | 25. m/0.22 mm/0.25 μm, He, 50. C @ 5. min, 5. K/min; Tend: 320. C |
Capillary | DB-5 | 976. | Fan and Qian, 2005 | 30. m/0.32 mm/0.25 μm, N2, 40. C @ 2. min, 4. K/min, 250. C @ 5. min |
Capillary | MDN-5 | 975. | van Loon, Linssen, et al., 2005 | 60. m/0.25 mm/0.25 μm, He, 40. C @ 4. min, 4. K/min, 270. C @ 5. min |
Capillary | MDN-5 | 980. | van Loon, Linssen, et al., 2005 | 60. m/0.25 mm/0.25 μm, He, 40. C @ 4. min, 4. K/min, 270. C @ 5. min |
Capillary | CP Sil 5 CB | 964. | Rohloff and Bones, 2005 | 30. m/0.25 mm/0.25 μm, He, 40. C @ 1. min, 4. K/min; Tend: 220. C |
Capillary | HP-5 | 976. | N/A | 30. m/0.32 mm/0.25 μm, Helium, 40. C @ 2. min, 5. K/min, 250. C @ 5. min |
Capillary | HP-1 | 953. | Valette, Fernandez, et al., 2003 | 50. m/0.2 mm/0.5 μm, He, 2. K/min, 220. C @ 40. min; Tstart: 60. C |
Capillary | RSL-200 | 950. | Jirovetz, Ngassoum, et al., 2002 | 30. m/0.32 mm/0.25 μm, H2, 50. C @ 5. min, 6. K/min, 280. C @ 5. min |
Capillary | DB-5 | 970. | Sanz, Czerny, et al., 2002 | 30. m/0.32 mm/0.25 μm, He, 40. C @ 2. min, 6. K/min, 230. C @ 5. min |
Capillary | DB-5MS | 970. | Lee, Suriyaphan, et al., 2001 | 60. m/0.25 mm/0.25 μm, He, 40. C @ 5. min, 2. K/min, 200. C @ 30. min |
Capillary | DB-5MS | 967. | Suriyaphan, Drake, et al., 2001 | 30. m/0.32 mm/0.25 μm, He, 40. C @ 5. min, 5. K/min, 195. C @ 40. min |
Capillary | DB-5 | 972. | Tellez, Schrader, et al., 2001 | 30. m/0.25 mm/0.25 μm, He, 3. K/min; Tstart: 60. C; Tend: 240. C |
Capillary | HP-5 | 972. | Boylston and Viniyard, 1998 | 50. m/0.32 mm/0.52 μm, 35. C @ 15. min, 2. K/min, 250. C @ 45. min |
Capillary | SE-54 | 964. | Ding, Deng, et al., 1998 | 35. C @ 3. min, 4. K/min; Column length: 25. m; Column diameter: 0.31 mm; Tend: 250. C |
Capillary | HP-5 | 970. | Kubec, Drhová, et al., 1998 | 30. m/0.25 mm/0.25 μm, N2, 40. C @ 3. min, 4. K/min, 240. C @ 10. min |
Capillary | DB-1 | 941. | Buttery, Ling, et al., 1997 | 30. C @ 25. min, 4. K/min, 200. C @ 20. min; Column length: 60. m; Column diameter: 0.25 mm |
Capillary | HP-1 | 935. | Lopes, Godoy, et al., 1997 | 25. m/0.32 mm/0.17 μm, H2, 5. K/min; Tstart: 40. C; Tend: 200. C |
Capillary | DB-1 | 963. | Rapior, Breheret, et al., 1997 | 30. m/0.2 mm/0.25 μm, He, 50. C @ 2. min, 4. K/min; Tend: 200. C |
Capillary | DB-1 | 958. | Rapior, Breheret, et al., 1997 | 30. m/0.2 mm/0.25 μm, He, 50. C @ 2. min, 4. K/min; Tend: 200. C |
Capillary | SE-54 | 969. | Bellesia, Pinetti, et al., 1996 | 25. m/0.2 mm/0.5 μm, He, 35. C @ 2. min, 5. K/min; Tend: 250. C |
Capillary | SE-54 | 977. | Milo and Grosch, 1996 | 30. m/0.52 mm/1.5 μm, 6. K/min; Tstart: 5. C; Tend: 230. C |
Capillary | SE-54 | 957. | Milo and Grosch, 1996 | 30. m/0.52 mm/1.5 μm, 6. K/min; Tstart: 5. C; Tend: 230. C |
Capillary | DB-1 | 931. | Hanum, Sinha, et al., 1995 | 30. m/0.25 mm/0.25 μm, He, 5. K/min; Tstart: 35. C; Tend: 150. C |
Capillary | RTX-5 | 977. | Milo and Grosch, 1995 | 30. m/0.52 mm/1.5 μm, He, 6. K/min; Tstart: 5. C; Tend: 230. C |
Capillary | OV-101 | 940. | Tamura, Nakamoto, et al., 1995 | N2, 2. K/min; Column length: 50. m; Column diameter: 0.25 mm; Tstart: 80. C; Tend: 200. C |
Capillary | OV-101 | 949. | Tamura, Nakamoto, et al., 1995 | N2, 2. K/min; Column length: 50. m; Column diameter: 0.25 mm; Tstart: 80. C; Tend: 200. C |
Capillary | DB-1 | 957. | Yu and Ho, 1995 | 60. m/0.25 mm/1. μm, He, 40. C @ 5. min, 2. K/min, 260. C @ 60. min |
Capillary | DB-1 | 941. | Buttery, Stern, et al., 1994 | He, 30. C @ 25. min, 4. K/min, 200. C @ 20. min; Column length: 60. m; Column diameter: 0.32 mm |
Capillary | DB-1 | 958. | Yu, Wu, et al., 1994 | 60. m/0.25 mm/1. μm, He, 40. C @ 5. min, 2. K/min, 260. C @ 60. min |
Capillary | DB-1 | 950. | Güntert, Bertram, et al., 1992 | 60. m/0.32 mm/0.25 μm, He, 3. K/min; Tstart: 60. C; Tend: 220. C |
Capillary | DB-1 | 941. | Hansen, Buttery, et al., 1992 | 30. C @ 25. min, 4. K/min, 200. C @ 20. min; Column length: 60. m; Column diameter: 0.32 mm |
Capillary | DB-5 | 950. | Sinha, Guyer, et al., 1992 | He, 2. K/min; Column length: 30. m; Column diameter: 0.2 mm; Tstart: 30. C; Tend: 200. C |
Capillary | HG-5 | 979. | Drumm and Spanier, 1991 | 50. m/0.32 mm/0.52 μm, He, 35. C @ 15. min, 3. K/min, 250. C @ 45. min |
Capillary | OV-101 | 950. | Misharina, Golovnya, et al., 1991 | 50. m/0.32 mm/0.5 μm, He, 4. K/min; Tstart: 50. C; Tend: 250. C |
Capillary | OV-101 | 949. | Sugisawa, Nakamura, et al., 1990 | Nitrogen, 2. K/min; Column length: 50. m; Column diameter: 0.25 mm; Tstart: 70. C; Tend: 200. C |
Capillary | OV-101 | 952. | Sugisawa, Nakamura, et al., 1990 | Nitrogen, 2. K/min; Column length: 50. m; Column diameter: 0.25 mm; Tstart: 80. C; Tend: 200. C |
Capillary | DB-1 | 940. | Flath, Matsumoto, et al., 1989 | 60. m/0.32 mm/0.25 μm, 4. K/min; Tstart: 50. C; Tend: 250. C |
Capillary | DB-1 | 940. | Flath, Matsumoto, et al., 1989 | 60. m/0.32 mm/0.25 μm, 4. K/min; Tstart: 50. C; Tend: 250. C |
Capillary | DB-1 | 941. | Flath, Matsumoto, et al., 1989 | 60. m/0.32 mm/0.25 μm, 4. K/min; Tstart: 50. C; Tend: 250. C |
Capillary | DB-1 | 941. | Flath, Matsumoto, et al., 1989 | 60. m/0.32 mm/0.25 μm, 4. K/min; Tstart: 50. C; Tend: 250. C |

Normal alkane RI, non-polar column, custom temperature program

Column type | Active phase | I | Reference | Comment |
---|---|---|---|---|
Capillary | TR-5 MS | 957. | Kurashov, Mitrukova, et al., 2014 | 15. m/0.25 mm/0.25 μm, Helium; Program: 35 0C (3 min) 2 0C/min -> 60 0C (3 min) 2 0C/min -> 80 0C (3 min) 4 0C/min -> 120 0C (3 min) 5 0C/min -> 150 0C (3 min) 15 0C/min -> 240 0C (10 min) |
Capillary | HP-5 MS | 976. | Kotowska, Zalikowski, et al., 2012 | 30. m/0.25 mm/0.25 μm, Helium; Program: not specified |
Capillary | Polydimethyl siloxane with 5 % Ph groups | 976. | Robinson, Adams, et al., 2012 | Program: not specified |
Capillary | Polydimethyl siloxane with 5 % Ph groups | 982. | Robinson, Adams, et al., 2012 | Program: not specified |
Capillary | HP-5 MS | 970. | Pino, Marquez, et al., 2010 | 30. m/0.32 mm/0.25 μm, Helium; Program: not specified |
Capillary | SE-54 | 969. | Christlbauer and Schieberle, 2009 | 30. m/0.32 mm/0.25 μm, Helium; Program: 35 0C (2 min) 10 0C/min -> 50 0C (2 min) 6 0C/min -> 250 0C |
Capillary | HP-5 | 974. | Rotsatschakul, Visesanguan, et al., 2009 | 60. m/0.25 mm/0.25 μm, Helium; Program: 30 0C (2 min) 2 0Cmin -> 60 0C 10 0C/min -> 100 0C 20 0C/min -> 140 0C 10 0C/min -> 200 0C (10 min) |
Capillary | HP-1 | 938. | Breme, Langle, et al., 2008 | 50. m/0.20 mm/0.33 μm, Helium; Program: not specified |
Capillary | SE-54 | 961. | Frauendorfer and Schieberle, 2008 | Helium; Program: not specified |
Capillary | Nonpolar | 974. | Staples and Zeiger, 2008 | Program: not specified |
Capillary | DB-5 MS | 970. | Liu, Xu, et al., 2007 | 60. m/0.32 mm/1.0 μm, Helium; Program: 40 0C (2 min) 6 0C/min -> 100 0C 4 0C/min -> 180 0C 8 0C/min -> 250 0C (12 min) |
Capillary | SPB-1 | 949. | Rao, Nagender, et al., 2007 | 30. m/0.32 mm/0.25 μm, Helium; Program: not specified |
Capillary | HP-5 | 953. | Splivallo, Bossi, et al., 2007 | He; Program: 50C => 3C/min => 200C(10min) => 10C/min => 290C(10min) |
Capillary | CP-Sil5 CB MS | 957. | Callemien, Dasnoy, et al., 2006 | 50. m/0.32 mm/1.2 μm, N2; Program: 36C => 20C/min => 85C => 1C/min => 145C => 3C/min => 250C(30min) |
Capillary | DB-1 | 943. | Chantreau, Rochat, et al., 2006 | 20. m/0.18 mm/0.18 μm; Program: not specified |
Capillary | DB-1 | 943. | Chantreau, Rochat, et al., 2006 | 20. m/0.18 mm/0.18 μm; Program: not specified |
Capillary | HP-5 MS | 955. | Pyun and Shin, 2006 | 30. m/0.25 mm/0.25 μm; Program: 40 0C (3 min) 2 0C/min -> 150 0C 20 0C/min -> 220 0C (5 min) |
Capillary | CP-Sil 5 CB | 957. | Callamien, Dasnoy, et al., 2005 | 50. m/0.32 mm/1.2 μm, Nitrogen; Program: 36 0C 20 0C/min -> 85 0C 1 iC/min -> 145 0C 3 0C/min -> 250 0C |
Capillary | CP-Sil 5 CB | 957. | Callemien, Dasnoy, et al., 2005 | 50. m/0.32 mm/1.20 μm, Nitrogen; Program: 36 0C 20 0C/min -> 85 0C 1 0C/min -> 145 0C 3 0C/min -> 250 0C |
Capillary | HP-5 | 973. | Thierry, Maillard, et al., 2005 | 60. m/0.32 mm/1. μm; Program: not specified |
Capillary | CP Sil 5 CB | 949. | Counet, Ouwerx, et al., 2004 | 50. m/0.32 mm/1.2 μm; Program: 36C => 20C/min => 85C => 1C/min => 145C => 3C/min => 250C(30min) |
Capillary | HP-5 | 982. | Garcia-Estaban, Ansorena, et al., 2004 | 50. m/0.32 mm/1.05 μm; Program: 40C(10min) => 5C/min => 200C => 20C/min => 250C(5min) |
Capillary | BPX-5 | 984. | Machiels, Istasse, et al., 2004 | 60. m/0.32 mm/1. μm, He; Program: 40C (4min) => 2C/min => 90C => 4C/min => 130C => 8C/min => 250 C (10min) |
Capillary | SPB-5 | 978. | Begnaud, Pérès, et al., 2003 | 60. m/0.32 mm/1. μm; Program: not specified |
Capillary | RTX-5 MS | 977. | Machiels and Istasse, 2003 | 60. m/0.25 mm/0.5 μm, He; Program: 35C (3min) => 10C/min => 50C => 4C/min => 200C => 50C/min => 250C (10min) |
Capillary | BPX-5 | 977. | Machiels, van Ruth, et al., 2003 | 60. m/0.32 mm/1. μm, He; Program: 40C (4min) => 2C/min => 90C => 4C/min => 130C => 8C/min => 250 C (10min) |
Capillary | BPX-5 | 977. | Machiels, van Ruth, et al., 2003 | 60. m/0.32 mm/1. μm, He; Program: 40C (4min) => 2C/min => 90C => 4C/min => 130C => 8C/min => 250 C (10min) |
Capillary | DB-5 | 950. | Qian and Reineccius, 2003 | 30. m/0.32 mm/1. μm; Program: 35C(4min) => 2C/min => 130C => 4C/min => 250C |
Capillary | CP Sil 5 CB | 969. | Counet, Callemien, et al., 2002 | 50. m/0.32 mm/1.2 μm; Program: 36C => 20C/min => 85C => 1C/min => 145C=3C/min => 250C(30min) |
Capillary | CP-Sil 5 CB | 959. | Gijs, Chevanese, et al., 2002 | 50. m/0.32 mm/1.20 μm, Helium; Program: 36 0C 20 0C/min -> 85 0C 1 0C/min -> 145 0C 3 0C/min -> 250 0C (30 min) |
Capillary | CP Sil 8 CB | 986. | Landy, Boucon, et al., 2002 | 60. m/0.32 mm/0.25 μm, He; Program: 40C(2min) => 40C/min => 60C(2min) => 6C/min => 250C(15min) |
Capillary | CP Sil 8 CB | 987. | Duckham, Dodson, et al., 2001 | 60. m/0.25 mm/0.25 μm; Program: not specified |
Capillary | CP Sil 5 CB | 961. | Lermusieau, Bulens, et al., 2001 | 50. m/0.32 mm/1.2 μm; Program: 36C => 20C/min => 120C(20min) => 2C/min => 250C(30min) |
Capillary | CP Sil 5 CB | 959. | Lermusieau, Bulens, et al., 2001 | 50. m/0.32 mm/1.2 μm; Program: 36C => 20C/min => 120C(20min) => 2C/min => 250C(30min) |
Capillary | DB-5 MS | 988. | Luo and Agnew, 2001 | 30. m/0.25 mm/1.0 μm, Helium; Program: not specified |
Capillary | SE-54 | 969. | Schieberle and Steinhaus, 2001 | Program: 35C (2min) => 40C/min => 50C (2min) => 6C/min => 180C => 10C/min => 240C |
Capillary | CP Sil 5 CB | 952. | Gijs, Piraprez, et al., 2000 | 50. m/0.32 mm/1.2 μm, He; Program: 33C (16.5min) => 2C/min => 160C => 20C/min => 200C (9min) |
Capillary | CP-Sil5 CB MS | 949. | Tirillini, Verdelli, et al., 2000 | 50. m/0.32 mm/0.4 μm; Program: 0C (3min) => 3C/min => 50C => 5C/min => 220C (30min) |
Capillary | RTX-5 | 967. | Masanetz, Guth, et al., 1998 | Program: not specified |
Capillary | RTX-5 | 967. | Masanetz, Guth, et al., 1998 | Program: not specified |
Capillary | DB-5 | 963. | Matsui, Guth, et al., 1998 | 30. m/0.32 mm/0.25 μm, He; Program: 35C(1min) => 40C/min => 60C (1min) => 6C/min => 230C |
Capillary | SE-54 | 968. | Zehentbauer and Grosch, 1998 | 25. m/0.32 mm/0.25 μm, He; Program: 35C(2min) => 50C/min => 60C(2min) => 4C/min => 230C |
Capillary | SE-54 | 970. | Guth, 1997 | 30. m/0.32 mm/0.25 μm; Program: 35C (1min) => 40C/min => 60C (1min) => 6C/min => 250C (10min) |
Capillary | SE-54 | 969. | Schermann and Schieberle, 1997 | 30. m/0.32 mm/0.25 μm, He; Program: 35C (2min) => 40C/min => 60C (2min) => 6C/min => 180C => 10C/min => 240C |
Capillary | SE-54 | 969. | Schermann and Schieberle, 1997 | 30. m/0.32 mm/0.25 μm, He; Program: 35C (2min) => 40C/min => 60C (2min) => 6C/min => 180C => 10C/min => 240C |
Capillary | SE-54 | 969. | Schermann and Schieberle, 1997 | 30. m/0.32 mm/0.25 μm, He; Program: 35C (2min) => 40C/min => 60C (2min) => 6C/min => 180C => 10C/min => 240C |
Capillary | DB-5 | 985. | Mateo and Zumalacárregui, 1996 | 50. m/0.32 mm/0.25 μm, He; Program: 40C (10min) => 3C/min => 95C => 10C/min => 270C (10min) |
Capillary | DB-5 | 981. | Mateo and Zumalacárregui, 1996 | 50. m/0.32 mm/0.25 μm, He; Program: 40C (10min) => 3C/min => 95C => 10C/min => 270C (10min) |
Capillary | Methyl Silicone | 949. | Misharina, 1995 | Program: not specified |
Capillary | SE-54 | 970. | Guth and Grosch, 1994 | Program: 0C (2min) => 6C/min => 50C (2min) => 6C/min => 230 C (10min) |
Capillary | DB-1 | 941. | Buttery, Teranishi, et al., 1990 | Column length: 60. m; Column diameter: 0.32 mm; Program: not specified |
Capillary | SE-54 | 974. | Blank, Fischer, et al., 1989 | 30. m/0.32 mm/0.3 μm, He; Program: 35C(2min) => 40C/min => 50C(2min) => 6C/min => 230C(10min) |
Capillary | methyl silicone oil with 5% Igepal | 940. | Schultz, Flath, et al., 1988 | Column length: 150. m; Column diameter: 0.75 mm; Program: not specified |
Capillary | methyl silicone oil with 5% Igepal | 949. | Schultz, Flath, et al., 1988 | Column length: 150. m; Column diameter: 0.75 mm; Program: not specified |
Capillary | OV-1, SE-30, Methyl silicone, SP-2100, OV-101, DB-1, etc. | 948. | Waggott and Davies, 1984 | Hydrogen; Column length: 50. m; Column diameter: 0.32 mm; Program: not specified |

Normal alkane RI, polar column, temperature ramp

Column type | Active phase | I | Reference | Comment |
---|---|---|---|---|
Capillary | HP-Innowax | 1331. | Puvipirom and Chaisei, 2012 | 15. m/0.32 mm/0.50 μm, Helium, 3. K/min; Tstart: 40. C; Tend: 250. C |
Capillary | DB-Wax | 1378. | Kumazawa, Sakai, et al., 2010 | 30. m/0.25 mm/0.25 μm, Helium, 3. K/min; Tstart: 40. C; Tend: 210. C |
Capillary | DB-Wax | 1354. | Chen, Song, et al., 2009 | 30. m/0.32 mm/0.25 μm, Helium, 40. C @ 2. min, 6. K/min, 230. C @ 20. min |
Capillary | DB-Wax | 1355. | Chen, Song, et al., 2009 | 30. m/0.32 mm/0.25 μm, Helium, 40. C @ 2. min, 6. K/min, 230. C @ 20. min |
Capillary | FFAP | 1367. | Christlbauer and Schieberle, 2009 | 30. m/0.32 mm/0.25 μm, Helium, 40. C @ 2. min, 6. K/min; Tend: 240. C |
Capillary | DB-Wax | 1384. | Rochat, Egger, et al., 2009 | 30. m/0.25 mm/0.25 μm, Helium, 60. C @ 3. min, 8. K/min, 200. C @ 9.5 min |
Capillary | DB-Wax | 1398. | Rochat, Egger, et al., 2009 | 30. m/0.25 mm/0.25 μm, Helium, 60. C @ 3. min, 8. K/min, 200. C @ 9.5 min |
Capillary | DB-Wax | 1421. | Rochat, Egger, et al., 2009 | 30. m/0.25 mm/0.25 μm, Helium, 60. C @ 3. min, 8. K/min, 200. C @ 9.5 min |
Capillary | DB-Wax | 1427. | Rochat, Egger, et al., 2009 | 30. m/0.25 mm/0.25 μm, Helium, 60. C @ 3. min, 8. K/min, 200. C @ 9.5 min |
Capillary | HP-20M | 1347. | Blazevic and Mastelic, 2008 | 50. m/0.25 mm/0.25 μm, Helium, 70. C @ 4. min, 4. K/min; Tend: 180. C |
Capillary | HP-20M | 1347. | Blazevic and Mastelic, 2008 | 50. m/0.25 mm/0.25 μm, Helium, 70. C @ 4. min, 4. K/min; Tend: 180. C |
Capillary | HP-20M | 1339. | Breme, Langle, et al., 2008 | 50. m/0.20 mm/0.20 μm, Helium, 2. K/min, 220. C @ 20. min; Tstart: 60. C |
Capillary | HP-Innowax | 1392. | Soria, Sanz, et al., 2008 | 50. m/0.20 mm/0.20 μm, Helium, 45. C @ 2. min, 4. K/min, 190. C @ 50. min |
Capillary | DB-Wax | 1360. | Fan and Qian, 2006 | 30. m/0.32 mm/0.25 μm, He, 40. C @ 2. min, 4. K/min, 230. C @ 15. min |
Capillary | DB-Wax | 1412. | Spadone, Matthey-Doret, et al., 2006 | 60. m/0.25 mm/0.25 μm, Helium, 35. C @ 3. min, 6. K/min, 240. C @ 10. min |
Capillary | ZB-Wax | 1408. | Wierda R.L., Fletcher G., et al., 2006 | 60. m/0.32 mm/0.5 μm, He, 40. C @ 2. min, 3. K/min, 250. C @ 10. min |
Capillary | Innowax | 1380. | Bendimerad and Bendiab, 2005 | 50. m/0.2 mm/0.5 μm, He, 2. K/min, 250. C @ 60. min; Tstart: 60. C |
Capillary | DB-Wax | 1368. | Fan and Qian, 2005 | 30. m/0.32 mm/0.25 μm, N2, 40. C @ 2. min, 4. K/min, 230. C @ 5. min |
Capillary | Carbowax 20M | 1372. | de la Fuente, Martinez-Castro, et al., 2005 | 50. m/0.25 mm/0.25 μm, Helium, 40. C @ 2. min, 4. K/min, 190. C @ 30. min |
Capillary | TC-Wax | 1406. | Ishizaki, Tachihara, et al., 2005 | 60. m/0.25 mm/0.25 μm, N2, 3. K/min, 220. C @ 40. min; Tstart: 70. C |
Capillary | HP-Innowax | 1369. | Isogai, Utsunomiya, et al., 2005 | 30. m/0.25 mm/0.25 μm, He, 40. C @ 5. min, 5. K/min, 240. C @ 15. min |
Capillary | CP-Wax 52CB | 1364. | Rohloff and Bones, 2005 | 30. m/0.32 mm/0.25 μm, He, 40. C @ 1. min, 4. K/min; Tend: 220. C |
Capillary | ZB-Wax | 1354. | N/A | 30. m/0.32 mm/0.25 μm, Helium, 40. C @ 2. min, 5. K/min, 250. C @ 5. min |
Capillary | DB-Wax | 1367. | Culleré, Escudero, et al., 2004 | 30. m/0.32 mm/0.5 μm, H2, 40. C @ 5. min, 4. K/min; Tend: 200. C |
Capillary | TC-Wax | 1399. | Ishikawa, Ito, et al., 2004 | 60. m/0.25 mm/0.5 μm, He, 40. C @ 8. min, 3. K/min; Tend: 230. C |
Capillary | HP-Innowax | 1398. | Soria, Gonzalez, et al., 2004 | 50. m/0.2 mm/0.2 μm, He, 45. C @ 2. min, 4. K/min, 190. C @ 50. min |
Capillary | DB-Wax | 1364. | López, Ortín, et al., 2003 | 30. m/0.32 mm/0.5 μm, H2, 40. C @ 5. min, 4. K/min; Tend: 200. C |
Capillary | TC-Wax | 1378. | Fukami, Ishiyama, et al., 2002 | 60. m/0.25 mm/0.25 μm, He, 2. K/min; Tstart: 50. C; Tend: 230. C |
Capillary | FFAP | 1365. | Lecanu, Ducruet, et al., 2002 | 30. m/0.32 mm/1. μm, He, 35. C @ 3. min, 5. K/min; Tend: 240. C |
Capillary | HP-FFAP | 1377. | Qian and Reineccius, 2002 | 25. m/0.32 mm/0.52 μm, 60. C @ 1. min, 5. K/min, 240. C @ 5. min |
Capillary | DB-FFAP | 1350. | Sanz, Czerny, et al., 2002 | 30. m/0.32 mm/0.25 μm, He, 40. C @ 2. min, 6. K/min, 230. C @ 5. min |
Capillary | EC-1000 | 1385. | Bendall, 2001 | 30. m/0.25 mm/0.25 μm, He, 35. C @ 5. min, 5. K/min, 230. C @ 15. min |
Capillary | DB-Wax | 1392. | Chyau and Mau, 2001 | 60. m/0.32 mm/0.25 μm, 50. C @ 5. min, 1.5 K/min, 210. C @ 10. min |
Capillary | DB-Wax | 1391. | Kumazawa and Masuda, 2001 | 30. m/0.53 mm/1. μm, He, 5. K/min; Tstart: 40. C; Tend: 210. C |
Capillary | DB-FFAP | 1358. | Suriyaphan, Drake, et al., 2001 | 30. m/0.32 mm/0.25 μm, He, 40. C @ 5. min, 5. K/min, 195. C @ 40. min |
Capillary | Supelcowax-10 | 1402. | Girard and Durance, 2000 | 60. m/0.25 mm/0.25 μm, He, 35. C @ 10. min, 4. K/min; Tend: 200. C |
Capillary | DB-Wax | 1374. | Buttery, Orts, et al., 1999 | 30. C @ 4. min, 2. K/min, 170. C @ 60. min; Column length: 60. m; Column diameter: 0.32 mm |
Capillary | DB-Wax | 1368. | Chyau and Mau, 1999 | 60. m/0.25 mm/0.25 μm, N2, 3. K/min; Tstart: 40. C; Tend: 210. C |
Capillary | DB-Wax | 1382. | Iwatsuki, Mizota, et al., 1999 | 4. K/min; Column length: 30. m; Column diameter: 0.53 mm; Tstart: 60. C; Tend: 210. C |
Capillary | DB-Wax | 1389. | Iwatsuki, Mizota, et al., 1999 | 4. K/min; Column length: 30. m; Column diameter: 0.53 mm; Tstart: 60. C; Tend: 210. C |
Capillary | DB-Wax | 1374. | Buttery and Ling, 1998 | 30. C @ 4. min, 2. K/min, 170. C @ 30. min; Column length: 60. m; Column diameter: 0.25 mm |
Capillary | HP-Innowax | 1381. | Kubec, Drhová, et al., 1998 | 30. m/0.25 mm/0.25 μm, N2, 40. C @ 3. min, 4. K/min, 190. C @ 10. min |
Capillary | CP-Wax 52CB | 1392. | Chyau, Lin, et al., 1997 | 50. m/0.32 mm/0.25 μm, He, 50. C @ 5. min, 1.5 K/min, 210. C @ 10. min |
Capillary | DB-Wax | 1365. | Takeoka, Buttery, et al., 1991 | 60. m/0.32 mm/0.25 μm, He, 30. C @ 4. min, 2. K/min, 180. C @ 25. min |
Capillary | Carbowax 20M | 1361. | Tressl and Silwar, 1981 | He, 2. K/min; Column length: 50. m; Column diameter: 0.25 mm; Tstart: 70. C; Tend: 180. C |

Normal alkane RI, polar column, custom temperature program

Column type | Active phase | I | Reference | Comment |
---|---|---|---|---|
Capillary | EC-1000 | 1385. | Delabre and Bendall, 9999 | Program: not specified |
Capillary | DB-Wax | 1366. | Rochat, Egger, et al., 2009 | 30. m/0.25 mm/0.25 μm, Helium; Program: not specified |
Capillary | FFAP | 1332. | Frauendorfer and Schieberle, 2008 | Helium; Program: not specified |
Capillary | DB-Wax | 1365. | Tao, Wenlai, et al., 2008 | 30. m/0.32 mm/0.25 μm, Helium; Program: 50 0C 20 0C/min -> 80 0C 3 0C/min -> 230 0C |
Capillary | Supelcowax-10 | 1381. | Berard, Bianchi, et al., 2007 | 30. m/0.25 mm/0.25 μm, He; Program: 35C(8min) => 6C/min => 60C => 4C/min => 160C => 20C/min => 200C(1min) |
Capillary | Supelcowax-10 | 1383. | Berard, Bianchi, et al., 2007 | 30. m/0.25 mm/0.25 μm, He; Program: 35C(8min) => 6C/min => 60C => 4C/min => 160C => 20C/min => 200C(1min) |
Capillary | DB-Wax | 1378. | Gyawalia, Seo, et al., 2006 | 60. m/0.2 mm/0.25 μm, He; Program: 40C(3min) => 2C/min => 150C => 4C/min => 220C(20min) => 5C/min => 230C |
Capillary | Carbowax 20M | 1357. | Editorial paper, 2005 | Program: not specified |
Capillary | TC-Wax | 1406. | Kraft and Switt, 2005 | Program: not specified |
Capillary | DB-Wax | 1376. | Kim. J.H., Ahn, et al., 2004 | 60. m/0.25 mm/0.25 μm, Helium; Program: 60 0C (3 min) 2 0C/min -> 150 0C 4 0C/min -> 200 0C |
Capillary | TC-Wax | 1406. | Tachihara, Ishizaki, et al., 2004 | Program: not specified |
Capillary | Supelcowax-10 | 1380. | Baek and Cadwallader, 2003 | 60. m/0.25 mm/0.25 μm; Program: not specified |
Capillary | DB-Wax | 1380. | Peterson and Reineccius, 2003, 2 | Program: not specified |
Capillary | DB-Wax | 1377. | Qian and Reineccius, 2003 | 60. m/0.32 mm/0.5 μm, He; Program: 35C(4min) => 2C/min => 130C => 4C/min => 250C |
Capillary | CP-Wax 52CB | 1402. | Muresan, Eillebrecht, et al., 2000 | 50. m/0.32 mm/1.2 μm; Program: 40C(10min) => 3C/min => 190C => 10C/min => 250C(5min) |
Capillary | Supelcowax-10 | 1411. | Forney and Jordan, 1998 | 60. m/0.53 mm/1. μm, He; Program: 40C (2min) => 16C/min => 120C => 15C/min => 240C(3min) |
Capillary | FFAP | 1342. | Matsui, Guth, et al., 1998 | 30. m/0.32 mm/0.25 μm, He; Program: 35C(1min) => 40C/min => 60C (1min) => 6C/min => 230C |
Capillary | FFAP | 1351. | Zehentbauer and Grosch, 1998 | 25. m/0.32 mm/0.25 μm, He; Program: 35C(2min) => 40C/min => 60C(2min) => 6C/min => 230C |
Capillary | DB-FFAP | 1360. | Guth, 1997 | 30. m/0.32 mm/0.25 μm; Program: 35C (1min) => 40C/min => 60C (1min) => 6C/min => 250C (10min) |
Capillary | FFAP | 1384. | Schermann and Schieberle, 1997 | 30. m/0.32 mm/0.25 μm, He; Program: 35C (2min) => 40C/min => 60C (2min) => 6C/min => 180C => 10C/min => 240C |
Capillary | FFAP | 1384. | Schermann and Schieberle, 1997 | 30. m/0.32 mm/0.25 μm, He; Program: 35C (2min) => 40C/min => 60C (2min) => 6C/min => 180C => 10C/min => 240C |
Capillary | CP Wax 52 CB | 1362. | Patterson and Stevenson, 1995 | 50. m/0.32 mm/0.20 μm; Program: 50 0C (10 min) 2 0C/min -> 100 0C 5 0C/min -> 150 0C 7 0C/min -> 220 0C (20 min) |
Capillary | CP-Wax 52CB | 1377. | Luning, de Rijk, et al., 1994 | 50. m/0.32 mm/1.5 μm; Program: 40C => 2C/min => 150C => 10C/min => 250C |
Capillary | CP-Wax 52CB | 1377. | Luning, de Rijk, et al., 1994 | 50. m/0.32 mm/1.5 μm; Program: 40C => 2C/min => 150C => 10C/min => 250C |

References

Cullen, Frost, et al., 1969
Cullen, W.R.; Frost, D.C.; Vroom, D.A.,
Ionization potentials of some sulfur compounds,
Inorg. Chem., 1969, 8, 1803. [all data]
Hobrock and Kiser, 1963
Hobrock, B.G.; Kiser, R.W.,
Electron impact investigations of sulfur compounds. III. 2-Thiapropane, 3-thiapentane, and 2,3,4-trithiapentane,
J. Phys. Chem., 1963, 67, 1283. [all data]
Chang, Young, et al., 1986
Chang, F.C.; Young, V.Y.; Prather, J.W.; Cheng, K.L.,
Study of methyl chalcogen compounds with ultraviolet photoelectron spectroscopy,
J. Electron Spectrosc. Relat. Phenom., 1986, 40, 363. [all data]
Misharina and Golovnya, 1989
Misharina, T.A.; Golovnya, R.V.,
Regularities of retention of a pseudohomologous series of dialkylpolysulfides in capillary gas chromatography,
Zh. Anal. Khim., 1989, 44, 514-519. [all data]
Galt and MacLeod, 1984
Galt, A.M.; MacLeod, G.,
Headspace sampling of cooked beef aroma using Tenax GC,
J. Agric. Food Chem., 1984, 32, 1, 59-64, https://doi.org/10.1021/jf00121a016
. [all data]
Jarunrattanasri, Theerakulkait, et al., 2007
Jarunrattanasri, A.; Theerakulkait, C.; Cadwallader, K.R.,
Aroma Components of Acid-Hydrolyzed Vegetable Protein Made by Partial Hydrolysis of Rice Bran Protein,
J. Agric. Food Chem., 2007, 55, 8, 3044-3050, https://doi.org/10.1021/jf0631474
. [all data]
Lozano P.R., Drake M., et al., 2007
Lozano P.R.; Drake M.; Benitez D.; Cadwallader K.R.,
Instrumental and sensory characterization of heat-induced odorants in aseptically packaged soy milk,
J. Agric. Food Chem., 2007, 55, 8, 3018-3026, https://doi.org/10.1021/jf0631225
. [all data]
Lozano P.R., Miracle E.R., et al., 2007
Lozano P.R.; Miracle E.R.; Krause A.J.; Drake M.; Cadwallader K.R.,
Effect of cold storage and packaging material on the major aroma components of sweet cream butter,
J. Agric. Food Chem., 2007, 55, 19, 7840-7846, https://doi.org/10.1021/jf071075q
. [all data]
Mahattanatawee K., Perez-Cacho P.R., et al., 2007
Mahattanatawee K.; Perez-Cacho P.R.; Davenport T.; Rouseff R.,
Comparison of three lychee cultivar odor profiles using gas chromatography-olfactometry and gas chromatography-sulfur detection,
J. Agric. Food Chem., 2007, 55, 5, 1939-1944, https://doi.org/10.1021/jf062925p
. [all data]
Methven L., Tsoukka M., et al., 2007
Methven L.; Tsoukka M.; Oruna-Concha M.J.; Parker J.K.; Mottram D.S.,
Influence of sulfur amino acids on the volatile and nonvolatile components of cooked salmon (Salmo salar),
J. Agric. Food Chem., 2007, 55, 4, 1427-1436, https://doi.org/10.1021/jf0625611
. [all data]
Rochat S., de Saint Laumer J.Y., et al., 2007
Rochat S.; de Saint Laumer J.Y.; Chaintreau A.,
Analysis of sulfur compounds from the in-oven roast beef aroma by comprehensive two-dimensional gas chromatography,
J. Chromatogr. A, 2007, 1147, 1, 85-94, https://doi.org/10.1016/j.chroma.2007.02.039
. [all data]
Ruiz Perez-Cacho, Mahattanatawee, et al., 2007
Ruiz Perez-Cacho, P.; Mahattanatawee, K.; Smoot, J.M.; Rouseff, R.,
Identification of Sulfur Volatiles in Canned Orange Juices Lacking Orange Flavor,
J. Agric. Food Chem., 2007, 55, 14, 5761-5767, https://doi.org/10.1021/jf0703856
. [all data]
Mahadevan and Farmer, 2006
Mahadevan, K.; Farmer, L.,
Key Odor Impact Compounds in Three Yeast Extract Pastes,
J. Agric. Food Chem., 2006, 54, 19, 7242-7250, https://doi.org/10.1021/jf061102x
. [all data]
Whetstine M.E.C., Drake M.A., et al., 2006
Whetstine M.E.C.; Drake M.A.; Nelson B.K.; Barbano D.M.,
Flavor profiles of full-fat and reduced-fat cheese and cheese fat made from aged cheddar with the fat removed using a novel process,
J. Dairy Res., 2006, 89, 2, 505-517, https://doi.org/10.3168/jds.S0022-0302(06)72113-0
. [all data]
Aliani and Farmer, 2005
Aliani, M.; Farmer, L.J.,
Precursors of chicken flavor. II. Identification of key flavor precursors using sensory methods,
J. Agric. Food Chem., 2005, 53, 16, 6455-6462, https://doi.org/10.1021/jf050087d
. [all data]
Carunchia Whetstine, Croissant, et al., 2005
Carunchia Whetstine, M.E.; Croissant, A.E.; Drake, M.A.,
Characterization of Dried Whey Protein Concentrate and Isolate Flavor,
J. Dairy Sci., 2005, 88, 11, 3826-3839, https://doi.org/10.3168/jds.S0022-0302(05)73068-X
. [all data]
Dickschat J.S., Wagner-Dobler I., et al., 2005
Dickschat J.S.; Wagner-Dobler I.; Schulz S.,
The chafer pheromone buibuilactone and ant pyrazines are also produced by marine bacteria,
J. Chem. Ecol., 2005, 31, 4, 925-947, https://doi.org/10.1007/s10886-005-3553-9
. [all data]
Solina, Baumgartner, et al., 2005
Solina, M.; Baumgartner, P.; Johnson, R.L.; Whitfield, F.B.,
Volatile aroma components of soy protein isolate and acid-hydrolysed vegetable protein,
Food Chem., 2005, 90, 4, 861-873, https://doi.org/10.1016/j.foodchem.2004.06.005
. [all data]
Whetstine, Cadwallader, et al., 2005
Whetstine, M.E.C.; Cadwallader, K.R.; Drake, M.A.,
Characterization of aroma compounds responsible for the rosy/floral flavor in cheddar cheese,
J. Agric. Food Chem., 2005, 53, 8, 3126-3132, https://doi.org/10.1021/jf048278o
. [all data]
Avsar, Karagul-Yuceer, et al., 2004
Avsar, Y.K.; Karagul-Yuceer, Y.; Drake, M.A.; Singh, T.K.; Yoon, Y.; Cadwallader, K.R.,
Characterization of nutty flavor in cheddar cheese,
J. Dairy Sci., 2004, 87, 7, 1999-2010, https://doi.org/10.3168/jds.S0022-0302(04)70017-X
. [all data]
Dickschat, Wenzel, et al., 2004
Dickschat, J.S.; Wenzel, S.C.; Bode, H.B.; Muller, R.; Schulz, S.,
Biosynthesis of Volatiles by the Myxobacterium Myxococcus xanthus,
ChemBioChem, 2004, 5, 6, 778-787, https://doi.org/10.1002/cbic.200300813
. [all data]
Hierro, de la Hoz, et al., 2004
Hierro, E.; de la Hoz, L.; Ordóñez, J.A.,
Headspace volatile compounds from salted and occasionally smoked dried meats (cecinas) as affected by animal species,
Food Chem., 2004, 85, 4, 649-657, https://doi.org/10.1016/j.foodchem.2003.07.001
. [all data]
Karagül-Yüceer, Vlahovich, et al., 2003
Karagül-Yüceer, Y.; Vlahovich, K.N.; Drake, M.A.; Cadwallader, K.R.,
Characteristic aroma components of rennet casein,
J. Agric. Food Chem., 2003, 51, 23, 6797-6801, https://doi.org/10.1021/jf0345806
. [all data]
Peterson and Reineccius, 2003
Peterson, D.G.; Reineccius, G.A.,
Characterization of the volatile compounds that constitute fresh sweet cream butter aroma,
Flavour Fragr. J., 2003, 18, 3, 215-220, https://doi.org/10.1002/ffj.1192
. [all data]
Peterson and Reineccius, 2003, 2
Peterson, D.G.; Reineccius, G.A.,
Determination of the aroma impact compounds in heated sweet cream butter,
Flavour Fragr. J., 2003, 18, 4, 320-324, https://doi.org/10.1002/ffj.1228
. [all data]
Bredie, Mottram, et al., 2002
Bredie, W.L.P.; Mottram, D.S.; Guy, R.C.E.,
Effect of temperature and pH on the generation of flavor volatiles in extrusion cooking of wheat flour,
J. Agric. Food Chem., 2002, 50, 5, 1118-1125, https://doi.org/10.1021/jf0111662
. [all data]
Duckham, Dodson, et al., 2002
Duckham, S.C.; Dodson, A.T.; Bakker, J.; Ames, J.M.,
Effect of cultivar and storage time on the volatile flavor components of baked potato,
J. Agric. Food Chem., 2002, 50, 20, 5640-5648, https://doi.org/10.1021/jf011326+
. [all data]
Karagül-Yüceer, Cadwallader, et al., 2002
Karagül-Yüceer, Y.; Cadwallader, K.R.; Drake, M.A.,
Volatile flavor components of stored nonfat dry milk,
J. Agric. Food Chem., 2002, 50, 2, 305-312, https://doi.org/10.1021/jf010648a
. [all data]
Oruna-Concha, Ames, et al., 2002
Oruna-Concha, M.J.; Ames, J.M.; Bakker, J.,
Comparison of the volatile components of eight cultivars of potato after microwave baking,
Lebensm. Wiss. Technol., 2002, 35, 1, 80-86, https://doi.org/10.1006/fstl.2001.0819
. [all data]
Wu and Cadwallader, 2002
Wu, Y.-F.G.; Cadwallader, K.R.,
Characterization of the aroma of a meatlike process flavoring from soybean-based enzyme-hydrolyzed vegetable protein,
J. Agric. Food Chem., 2002, 50, 10, 2900-2907, https://doi.org/10.1021/jf0114076
. [all data]
Zhou, Wintersteen, et al., 2002
Zhou, Q.; Wintersteen, C.L.; Cadwallader, K.R.,
Identification and quantification of aroma-active components that contribute to the distinct malty flavor of buckwheat honey,
J. Agric. Food Chem., 2002, 50, 7, 2016-2021, https://doi.org/10.1021/jf011436g
. [all data]
Baek, Kim, et al., 2001
Baek, H.H.; Kim, C.J.; Ahn, B.H.; Nam, H.S.; Cadwallader, K.R.,
Aroma extract dilution analysis of a beeflike process flavor from extruded enzyme-hydrolyzed soybean protein,
J. Agric. Food Chem., 2001, 49, 2, 790-793, https://doi.org/10.1021/jf000609j
. [all data]
Kim, 2001
Kim, J.S.,
Einfluss der Temperatur beim Rösten von Sesam auf Aroma und antioxidative Eigenschaften des Öls, PhD Thesis, Technischen Universität Berlin zur Erlangung des akademischen Grades, Berlin, 2001, 151. [all data]
Lee, Suriyaphan, et al., 2001
Lee, G.-H.; Suriyaphan, O.; Cadwallader, K.R.,
Aroma components of cooked tail meat of American lobster (Homarus americanus),
J. Agric. Food Chem., 2001, 49, 9, 4324-4332, https://doi.org/10.1021/jf001523t
. [all data]
Oruna-Concha, Duckham, et al., 2001
Oruna-Concha, M.J.; Duckham, S.C.; Ames, J.M.,
Comparison of volatile compounds isolated from the skin and flesh of four potato cultivars after baking,
J. Agric. Food Chem., 2001, 49, 5, 2414-2421, https://doi.org/10.1021/jf0012345
. [all data]
Pino, Fuentes, et al., 2001
Pino, J.A.; Fuentes, V.; Correa, M.T.,
Volatile constituents of Chinese chive (Allium tuberosum Rottl. ex Sprengel) and Rakkyo (Allium chinense G. Don),
J. Agric. Food Chem., 2001, 49, 3, 1328-1330, https://doi.org/10.1021/jf9907034
. [all data]
Rychlik and Bosset, 2001
Rychlik, M.; Bosset, J.O.,
Flavour and off-flavour compoundsof SwissGruy ere cheese. Evaluation of potent odorants,
Int. Dairy J., 2001, 11, 11-12, 895-901, https://doi.org/10.1016/S0958-6946(01)00108-X
. [all data]
Elmore, Mottram, et al., 2000
Elmore, J.S.; Mottram, D.S.; Hierro, E.,
Two-fibre solid-phase microextraction combined with gas chromatography-mass spectrometry for the analysis of volatile aroma compounds in cooked pork,
J. Chromatogr. A, 2000, 905, 1-2, 233-240, https://doi.org/10.1016/S0021-9673(00)00990-0
. [all data]
Song, Sawamura, et al., 2000
Song, H.S.; Sawamura, M.; Ito, T.; Kawashimo, K.; Ukeda, H.,
Quantitative determination of characteric flavour of Citrus junos (yuzu) peel oil,
Flavour Fragr. J., 2000, 15, 4, 245-250, https://doi.org/10.1002/1099-1026(200007/08)15:4<245::AID-FFJ904>3.0.CO;2-V
. [all data]
Chevance and Farmer, 1999
Chevance, F.F.V.; Farmer, L.J.,
Identification of major volatile odor compounds in frankfurters,
J. Agric. Food Chem., 1999, 47, 12, 5151-5160, https://doi.org/10.1021/jf990515d
. [all data]
Mandin, Duckham, et al., 1999
Mandin, O.; Duckham, S.C.; Ames, J.M.,
Volatile compounds from potato-like model systems,
J. Agric. Food Chem., 1999, 47, 6, 2355-2359, https://doi.org/10.1021/jf981277+
. [all data]
Valero, Sanz, et al., 1999
Valero, E.; Sanz, J.; Martinez-Castro, I.,
Volatile components in microwave- and conventionally-heated milk,
Food Chem., 1999, 66, 3, 333-338, https://doi.org/10.1016/S0308-8146(99)00069-2
. [all data]
Aaslyng, Elmore, et al., 1998
Aaslyng, M.D.; Elmore, J.S.; Mottram, D.S.,
Comparison of the aroma characteristics of acid-hydrolyzed and enzyme-hydrolyzed vegetable proteins produced from soy,
J. Agric. Food Chem., 1998, 46, 12, 5225-5231, https://doi.org/10.1021/jf9806816
. [all data]
Cha and Cadwallader, 1998
Cha, Y.J.; Cadwallader, K.R.,
Aroma-active compounds in skipjack tuna sauce,
J. Agric. Food Chem., 1998, 46, 3, 1123-1128, https://doi.org/10.1021/jf970380g
. [all data]
Verdier-Metz., Coulon, et al., 1998
Verdier-Metz., I.; Coulon, J.-B.; PPradel, P.; Viallon, C.; Berdague, J.-L.,
Effect of forage conservation (hay or silage) and cow breed on the coagulation properties of milks and on the characteristics of ripened cheeses,
J. Dairy Res., 1998, 65, 1, 9-21, https://doi.org/10.1017/S0022029997002616
. [all data]
Lee, DeMilo, et al., 1997
Lee, C.-J.; DeMilo, A.B.; Moreno, D.S.; Mangan, R.L.,
Identification of the volatile components of E802 Mazoferm steepwater, a condensed fermented corn extractive highly attractive to the Mexican fruit fly (Diptera: Tephritidae),
J. Agric. Food Chem., 1997, 45, 6, 2327-2331, https://doi.org/10.1021/jf960632y
. [all data]
Milo and Reineccius, 1997
Milo, C.; Reineccius, G.A.,
Identification and quantification of potent odorants in regular-fat and low-fat mild cheddar cheese,
J. Agric. Food Chem., 1997, 45, 9, 3590-3594, https://doi.org/10.1021/jf970152m
. [all data]
DeMilo, Lee, et al., 1996
DeMilo, A.B.; Lee, C.-J.; Moreno, D.S.; Martinez, A.J.,
Identification of volatiles derived from Citrobacter freundii fermentation of a trypticase soy broth,
J. Agric. Food Chem., 1996, 44, 2, 607-612, https://doi.org/10.1021/jf950525o
. [all data]
Kim, Wu, et al., 1995
Kim, S.M.; Wu, C.M.; Kobayashi, A.; Kubota, K.; Okumura, J.,
Volatile compounds in stir-fried garlic,
J. Agric. Food Chem., 1995, 43, 11, 2951-2955, https://doi.org/10.1021/jf00059a033
. [all data]
Specht and Baltes, 1994
Specht, K.; Baltes, W.,
Identification of volatile flavor compounds with high aroma values from shallow-fried beef,
J. Agric. Food Chem., 1994, 42, 10, 2246-2253, https://doi.org/10.1021/jf00046a031
. [all data]
Yu, Lin, et al., 1994
Yu, T.-H.; Lin, L.-Y.; Ho, C.-T.,
Volatile compounds of blanched, fried blanched, and baked blanched garlic slices,
J. Agric. Food Chem., 1994, 42, 6, 1342-1347, https://doi.org/10.1021/jf00042a018
. [all data]
Farkas, Hradský, et al., 1992
Farkas, P.; Hradský, P.; Kovác, M.,
Novel flavour components identified in the steamn distillate of onion (Allium cepa L.),
Z. Lebensm. Unters. Forsch., 1992, 195, 5, 459-462, https://doi.org/10.1007/BF01191718
. [all data]
Kuo and Ho, 1992
Kuo, M.-C.; Ho, C.-T.,
Volatile constituents of the distilled oils of Welsh onions (Allium fistulosum L. variety Maichuon) and scallions (Allium fistulosum L. variety Caespitosum),
J. Agric. Food Chem., 1992, 40, 1, 111-117, https://doi.org/10.1021/jf00013a021
. [all data]
Kuo and Ho, 1992, 2
Kuo, M.-C.; Ho, C.-T.,
Volatile constituents of the solvent extracts of Welsh onions (Allium fistulosum L. variety Maichuon) and scallions (A. fistulosum L. variety caepitosum),
J. Agric. Food Chem., 1992, 40, 10, 1906-1910, https://doi.org/10.1021/jf00022a036
. [all data]
Zhang, Dorjpalam, et al., 1992
Zhang, Y.; Dorjpalam, B.; Ho, C.-T.,
Contribution of peptides to volatile formation in the Maillard reaction of casein hydrolysate with glucose,
J. Agric. Food Chem., 1992, 40, 12, 2467-2471, https://doi.org/10.1021/jf00024a026
. [all data]
Izzo and Ho, 1991
Izzo, H.V.; Ho, C.-T.,
Isolation and identification of the volatile components of an extruded autolyzed yeast extract,
J. Agric. Food Chem., 1991, 39, 12, 2245-2248, https://doi.org/10.1021/jf00012a029
. [all data]
Chen and Ho, 1986
Chen, C.-C.; Ho, C.-T.,
Identification of sulfurous compounds of shiitake mushroom (Lentinus edodes Sing.),
J. Agric. Food Chem., 1986, 34, 5, 830-833, https://doi.org/10.1021/jf00071a016
. [all data]
Schreyen, Dirinck, et al., 1976
Schreyen, L.; Dirinck, P.; van Wassenhove, F.; Schamp, N.,
Analysis of leek volatiles by headspace condensation,
J. Agric. Food Chem., 1976, 24, 6, 1147-1152, https://doi.org/10.1021/jf60208a023
. [all data]
Schreyen, Dirinck, et al., 1976, 2
Schreyen, L.; Dirinck, P.; van Wassenhove, F.; Schamp, N.,
Volatile flavor components of leek,
J. Agric. Food Chem., 1976, 24, 2, 336-341, https://doi.org/10.1021/jf60204a056
. [all data]
Andriamaharavo, 2014
Andriamaharavo, N.R.,
Retention Data. NIST Mass Spectrometry Data Center., NIST Mass Spectrometry Data Center, 2014. [all data]
Majcher and Jelen, 2007
Majcher, M.A.; Jelen, H.H.,
Effect of Cysteine and Cystine Addition on Sensory Profile and Potent Odorants of Extruded Potato Snacks,
J. Agric. Food Chem., 2007, 55, 14, 5754-5760, https://doi.org/10.1021/jf0703147
. [all data]
Frauendorfer and Schieberle, 2006
Frauendorfer, F.; Schieberle, P.,
Identification of the key aroma compounds in Cocoa powder based on molecular sensoly correlations,
J. Agr. Food Chem., 2006, 54, 15, 5521-5529, https://doi.org/10.1021/jf060728k
. [all data]
Bonaiti, Irlinger, et al., 2005
Bonaiti, C.; Irlinger, F.; Spinnler, H.E.; Engel, E.,
An iterative sensory procedure to select odor-active associations in complex consortia of microorganisms: application to the construction of a cheese model,
J. Dairy Sci., 2005, 88, 5, 1671-1684, https://doi.org/10.3168/jds.S0022-0302(05)72839-3
. [all data]
Majcher and Jelén, 2005
Majcher, M.A.; Jelén, H.H.,
Identification of potent odorants formed during the preparation of extruded potato snacks,
J. Agric. Food Chem., 2005, 53, 16, 6432-6437, https://doi.org/10.1021/jf050412x
. [all data]
Klesk and Qian, 2003
Klesk, K.; Qian, M.,
Aroma extract dilution analysis of Cv. Marion (Rubus spp. hyb) and Cv. Evergreen (R. Iaciniatus L.) blackberries,
J. Agric. Food Chem., 2003, 51, 11, 3436-3441, https://doi.org/10.1021/jf0262209
. [all data]
Klesk and Qian, 2003, 2
Klesk, K.; Qian, M.,
Preliminary aroma comparison of Marion (Rubus spp. hyb) and Evergreen (R. laciniatus L.) blackberries by dynamic headspace/OSME technique,
J. Food Sci., 2003, 68, 2, 697-700, https://doi.org/10.1111/j.1365-2621.2003.tb05734.x
. [all data]
Byrne, Bredie, et al., 2002
Byrne, D.V.; Bredie, W.L.P.; Mottram, D.S.; Martens, M.,
Sensory and chemical investigations on the effect of oven cooking on warmed-over flavour development in chicken meat,
Meat Sci., 2002, 61, 2, 127-139, https://doi.org/10.1016/S0309-1740(01)00171-1
. [all data]
Carrapiso, Ventanas, et al., 2002
Carrapiso, A.I.; Ventanas, J.; García, C.,
Characterization of the most odor-active compounds of Iberian ham headspace,
J. Agric. Food Chem., 2002, 50, 7, 1996-2000, https://doi.org/10.1021/jf011094e
. [all data]
Engel, Baty, et al., 2002
Engel, E.; Baty, C.; le Corre, D.; Souchon, I.; Martin, N.,
Flavor-active compounds potentially implicated in cooked cauliflower acceptance,
J. Agric. Food Chem., 2002, 50, 22, 6459-6467, https://doi.org/10.1021/jf025579u
. [all data]
Kirchhoff and Schieberle, 2002
Kirchhoff, E.; Schieberle, P.,
Quantitation of odor-active compounds in rye flour and rye sourdough using stable isotope dilution assays,
J. Agric. Food Chem., 2002, 50, 19, 5378-5385, https://doi.org/10.1021/jf020236h
. [all data]
Oruna-Concha, Bakker, et al., 2002
Oruna-Concha, M.J.; Bakker, J.; Ames, J.M.,
Comparison of the volatile components of two cultivars of potato cooked by boiling, conventional baking and microwave baking,
J. Sci. Food Agric., 2002, 82, 9, 1080-1087, https://doi.org/10.1002/jsfa.1148
. [all data]
Zehentbauer and Reineccius, 2002
Zehentbauer, G.; Reineccius, G.A.,
Determination of key aroma components of cheddar cheese using dynamic headspace dilution assay,
Flavour Fragr. J., 2002, 17, 4, 300-305, https://doi.org/10.1002/ffj.1102
. [all data]
Duckham, Dodson, et al., 2001
Duckham, S.C.; Dodson, A.T.; Bakker, J.; Ames, J.M.,
Volatile flavour components of baked potato flesh. A comparison of eleven potato cultivars,
Nahrung/Food, 2001, 45, 5, 317-323, https://doi.org/10.1002/1521-3803(20011001)45:5<317::AID-FOOD317>3.0.CO;2-4
. [all data]
Kirchhoff and Schieberle, 2001
Kirchhoff, E.; Schieberle, P.,
Determination of key aroma compounds in the crumb of a three-stage sourdough rye bread by stable isotope dilution assays and sensory studies,
J. Agric. Food Chem., 2001, 49, 9, 4304-4311, https://doi.org/10.1021/jf010376b
. [all data]
Martin and Ames, 2001
Martin, F.L.; Ames, J.M.,
Formation of Strecker aldehydes and pyrazines in a fried potato model system,
J. Agric. Food Chem., 2001, 49, 8, 3885-3892, https://doi.org/10.1021/jf010310g
. [all data]
Martin and Ames, 2001, 2
Martin, F.L.; Ames, J.M.,
Comparison of flavor compounds of potato chips fried in palmolein and silicone fluid,
J. Amer. Oil Chem. Soc., 2001, 78, 8, 863-866, https://doi.org/10.1007/s11746-001-0356-2
. [all data]
Elmore, Mottram, et al., 2000, 2
Elmore, J.S.; Mottram, D.S.; Enser, M.; Wood, J.D.,
The effects of diet and breed on the volatile compounds of cooked lamb,
Meat Sci., 2000, 55, 2, 149-159, https://doi.org/10.1016/S0309-1740(99)00137-0
. [all data]
Eri, Khoo, et al., 2000
Eri, S.; Khoo, B.K.; Lech, J.; Hartman, T.G.,
Direct thermal desorption-gas chromatography and gas chromatography-mass spectrometry profiling of hop (Humulus lupulus L.) essential oils in support of varietal characterization,
J. Agric. Food Chem., 2000, 48, 4, 1140-1149, https://doi.org/10.1021/jf9911850
. [all data]
Munk, Munch, et al., 2000
Munk, S.; Munch, P.; Stahnke, L.; Adler-Nissen., J.; Schieberle, P.,
Primary odorants of laundry soiled with sweat/sebum: influence of lipase on the odor profile,
Journal of Surfactants and Detergents, 2000, 3, 4, 505-515, https://doi.org/10.1007/s11743-000-0150-z
. [all data]
Tairu, Hofmann, et al., 2000
Tairu, A.O.; Hofmann, T.; Schieberle, P.,
Studies on the key odorants formed by roasting of wild mango seeds (Irvingia gabonensis),
J. Agric. Food Chem., 2000, 48, 6, 2391-2394, https://doi.org/10.1021/jf990765u
. [all data]
Elmore, Mottram, et al., 1999
Elmore, J.S.; Mottram, D.S.; Enser, M.; Wood, J.D.,
Effect of the polyunsaturated fatty acid composition of beef muscle on the profile of aroma volatiles,
J. Agric. Food Chem., 1999, 47, 4, 1619-1625, https://doi.org/10.1021/jf980718m
. [all data]
Mutti and Grosch, 1999
Mutti, B.; Grosch, W.,
Potent odorants of boiled potatoes,
Nahrung, 1999, 43, 5, 302-306, https://doi.org/10.1002/(SICI)1521-3803(19991001)43:5<302::AID-FOOD302>3.0.CO;2-8
. [all data]
Bredie, Mottram, et al., 1998
Bredie, W.L.P.; Mottram, D.S.; Guy, R.C.E.,
Aroma volatiles generated during extrusion cooking of maize flour,
J. Agric. Food Chem., 1998, 46, 4, 1479-1487, https://doi.org/10.1021/jf9708857
. [all data]
Fickert and Schieberle, 1998
Fickert, B.; Schieberle, P.,
Identification of the key odorants in barley malt (caramalt) using GC/MS techniques and odour dilution analyses,
Nahrung, 1998, 42, 6, 371-375, https://doi.org/10.1002/(SICI)1521-3803(199812)42:06<371::AID-FOOD371>3.0.CO;2-V
. [all data]
Mochizuki, Yamamoto, et al., 1998
Mochizuki, E.; Yamamoto, T.; Komiyama, Y.; Nakazawa, H.,
Identification of allium products using flame photometric detection gas chromatography and distribution patterns of volatile sulfur compounds,
J. Agric. Food Chem., 1998, 46, 12, 5170-5176, https://doi.org/10.1021/jf9803076
. [all data]
Heiler and Schieberle, 1997
Heiler, C.; Schieberle, P.,
Quantitative instrumental and sensory studies on Aroma compounds contributing to a metallic flavour defect in buttermilk,
Int. Dairy J., 1997, 7, 10, 659-666, https://doi.org/10.1016/S0958-6946(97)00067-8
. [all data]
Kubícková and Grosch, 1997
Kubícková, J.; Grosch, W.,
Evaluation of potent odorants of camembert cheese by dilution and concentration techniques,
Int. Dairy J., 1997, 7, 1, 65-70, https://doi.org/10.1016/S0958-6946(96)00044-1
. [all data]
Beal and Mottram, 1994
Beal, A.D.; Mottram, D.S.,
Compounds contributing to the characteristic aroma of malted barley,
J. Agric. Food Chem., 1994, 42, 12, 2880-2884, https://doi.org/10.1021/jf00048a043
. [all data]
Pozo-Bayon M.A., Ruiz-Rodriguez A., et al., 2007
Pozo-Bayon M.A.; Ruiz-Rodriguez A.; Pernin K.; Cayot N.,
Influence of eggs on the aroma composition of a sponge cake and on the aroma release in model studies on flavored sponge cakes,
J. Agric. Food Chem., 2007, 55, 4, 1418-1426, https://doi.org/10.1021/jf062203y
. [all data]
Fernandez-Segovia, Escriche, et al., 2006
Fernandez-Segovia, I.; Escriche, I.; Gomez-Sintes, M.; Fuentes, A.; Serra, J.A.,
In?uence of di?erent preservation treatments on the volatile fraction of desalted cod,
Food Chem., 2006, 98, 3, 473-482, https://doi.org/10.1016/j.foodchem.2005.06.021
. [all data]
Lopez-Galilea I., Fournier N., et al., 2006
Lopez-Galilea I.; Fournier N.; Cid C.; Guichard E.,
Changes in headspace volatile concentrations of coffee brews caused by the roasting process and the brewing procedure,
J. Agric. Food Chem., 2006, 54, 22, 8560-8566, https://doi.org/10.1021/jf061178t
. [all data]
Alasalvar, Taylor, et al., 2005
Alasalvar, C.; Taylor, K.D.A.; Shahidi, F.,
Comparison of volatiles of cultured and wild sea bream (Sparus aurata) during storage in ice by dynamic headspace analysis/gas chromatography-mass spectrometry,
J. Agric. Food Chem., 2005, 53, 7, 2616-2622, https://doi.org/10.1021/jf0483826
. [all data]
Fang and Qian, 2005
Fang, Y.; Qian, M.,
Aroma compounds in Oregon Pinot Noir wine determined by aroma extract dilution analysis (AEDA),
Flavour Fragr. J., 2005, 20, 1, 22-29, https://doi.org/10.1002/ffj.1551
. [all data]
Verzera, Campisi, et al., 2005
Verzera, A.; Campisi, S.; Zappalá, M.,
SUPELCO. Using SPME-GC-MS to characterize volatile components of honey as indicators of botanical origin, 2005, retrieved from http://www.sigmaaldrich.com/Brands/SupelcoHome/TheReporter.html. [all data]
Calvo-Gómez, Morales-López, et al., 2004
Calvo-Gómez, O.; Morales-López, J.; López, M.G.,
Solid-phase microextraction-gas chromatographic-mass spectrometric analysis of garlic oil obtained by hydrodistillation,
J. Chromatogr. A, 2004, 1036, 1, 91-93, https://doi.org/10.1016/j.chroma.2004.02.072
. [all data]
Mahajan, Goddik, et al., 2004
Mahajan, S.S.; Goddik, L.; Qian, M.C.,
Aroma Compounds in Sweet Whey Powder,
J. Dairy Sci., 2004, 87, 12, 4057-4063, https://doi.org/10.3168/jds.S0022-0302(04)73547-X
. [all data]
Nielsen, Larsen, et al., 2004
Nielsen, G.S.; Larsen, L.M.; Poll, L.,
Impact of blanching and packaging atmosphere on the formation of aroma compounds during long-term frozen storage of leek (Allium ampeloprasum Var. Bulga) slices,
J. Agric. Food Chem., 2004, 52, 15, 4844-4852, https://doi.org/10.1021/jf049623c
. [all data]
Nielsen and Poll, 2004
Nielsen, G.S.; Poll, L.,
Determination of odor active aroma compounds in freshly cut leek (Allium ampeloprasum Var. Bulga) and in long-term stored frozen unblanched and blanched leek slices by gas chromatography olfactometry analysis,
J. Agric. Food Chem., 2004, 52, 6, 1642-1646, https://doi.org/10.1021/jf030682k
. [all data]
Nielsen, Larsen, et al., 2003
Nielsen, G.S.; Larsen, L.M.; Poll, L.,
Formation of aroma compounds and lipoxygenase (EC 1.13.11.12) activity in unblanced leek (Allium ampeloprasum Var. Bulga) slices during long-term frozen storage,
J. Agric. Food Chem., 2003, 51, 7, 1970-1976, https://doi.org/10.1021/jf020921o
. [all data]
Edris and Fadel, 2002
Edris, A.E.; Fadel, H.M.,
Investigation of the volatile aroma components of garlic leaves essential oil. Possibility of utilization to enrich garlic bulb oil,
Eur. Food Res. Technol., 2002, 214, 2, 105-107, https://doi.org/10.1007/s00217-001-0429-2
. [all data]
le Guen, Prost, et al., 2001
le Guen, S.; Prost, C.; Demaimay, M.,
Evaluation of the representativeness of the odor of cooked mussel extracts and the relationship between sensory descriptors and potent odorants,
J. Agric. Food Chem., 2001, 49, 3, 1321-1327, https://doi.org/10.1021/jf000781n
. [all data]
Liu, Yang, et al., 2001
Liu, T.-T.; Yang, T.-S.; Wu, C.-M.,
Changes of volatiles in soy sauce-stewed pork during cold storage and reheating,
J. Sci. Food Agric., 2001, 81, 15, 1547-1552, https://doi.org/10.1002/jsfa.978
. [all data]
Verzera, Campisi, et al., 2001
Verzera, A.; Campisi, S.; Zappalá, M.; Bonaccorsi, I.,
SPME-GC-MS analysis of honey volatile components for the characterization of different floral origin,
Am. Lab. Fairfield Conn., 2001, 33, 15, 18-21. [all data]
Chevance, Farmer, et al., 2000
Chevance, F.F.V.; Farmer, L.J.; Desmond, E.M.; Novelli, E.; Troy, D.J.; Chizzolini, R.,
Effect of some fat replacers on the release of volatile aroma compounds from low-fat meat products,
J. Agric. Food Chem., 2000, 48, 8, 3476-3484, https://doi.org/10.1021/jf991211u
. [all data]
le Guen, Prost, et al., 2000
le Guen, S.; Prost, C.; Demaimay, M.,
Critical comparison of three olfactometric methods for the identification of the most potent odorants in cooked mussels (Mytilus edulis),
J. Agric. Food Chem., 2000, 48, 4, 1307-1314, https://doi.org/10.1021/jf990745s
. [all data]
Le Guen, Prost, et al., 2000
Le Guen, S.; Prost, C.; Demaimay, M.,
Characterization of odorant compounds of mussels (Mytilus edulis) according to their origin using gas chromatography-olfactometry and gas chromatography-mass spectrometry,
J. Chromatogr. A, 2000, 896, 1-2, 361-371, https://doi.org/10.1016/S0021-9673(00)00729-9
. [all data]
Chevance and Farmer, 1999, 2
Chevance, F.F.V.; Farmer, L.J.,
Release of volatile odor compounds from full-fat and reduced-fat frankfurters,
J. Agric. Food Chem., 1999, 47, 12, 5161-5168, https://doi.org/10.1021/jf9905166
. [all data]
Chung, 1999
Chung, H.Y.,
Volatile components in crabmeats of Charybdis feriatus,
J. Agric. Food Chem., 1999, 47, 6, 2280-2287, https://doi.org/10.1021/jf981027t
. [all data]
Cha, Kim, et al., 1998
Cha, Y.J.; Kim, H.; Cadwallader, K.R.,
Aroma-active compounds in Kimchi during fermentation,
J. Agric. Food Chem., 1998, 46, 5, 1944-1953, https://doi.org/10.1021/jf9706991
. [all data]
Ott, Fay, et al., 1997
Ott, A.; Fay, L.B.; Chaintreau, A.,
Determination and origin of the aroma impact compounds of yogurt flavor,
J. Agric. Food Chem., 1997, 45, 3, 850-858, https://doi.org/10.1021/jf960508e
. [all data]
Shimoda, Peralta, et al., 1996
Shimoda, M.; Peralta, R.R.; Osajima, Y.,
Headspace gas analysis of fish sauce,
J. Agric. Food Chem., 1996, 44, 11, 3601-3605, https://doi.org/10.1021/jf960345u
. [all data]
Kim, Wu, et al., 1995, 2
Kim, S.M.; Wu, C.M.; Kubota, K.; Kobayashi, A.,
Effect of soybean oil on garlic volatile compounds isoalted by distillation,
J. Agric. Food Chem., 1995, 43, 2, 449-452, https://doi.org/10.1021/jf00050a036
. [all data]
Chung and Cadwallader, 1993
Chung, H.Y.; Cadwallader, K.R.,
Volatile components in blue crab (Callinectes sapidus) meat and processing by-product,
J. Food Sci., 1993, 58, 6, 1203-1207, https://doi.org/10.1111/j.1365-2621.1993.tb06148.x
. [all data]
Yu, Wu, et al., 1993
Yu, T.-H.; Wu, C.-M.; Ho, C.-T.,
Volatile compounds of deep-oil fried, microwave-heated, and oven-baked garlic slices,
J. Agric. Food Chem., 1993, 41, 5, 800-805, https://doi.org/10.1021/jf00029a023
. [all data]
Tanchotikul and Hsieh, 1989
Tanchotikul, U.; Hsieh, T.C.-Y.,
Volatile Flavor Components in Crayfish Waste,
J. Food Sci., 1989, 54, 6, 1515-1520, https://doi.org/10.1111/j.1365-2621.1989.tb05149.x
. [all data]
Yu, Wu, et al., 1989
Yu, T.-H.; Wu, C.-M.; Liou, Y.-C.,
Volatile compounds from garlic,
J. Agric. Food Chem., 1989, 37, 3, 725-730, https://doi.org/10.1021/jf00087a032
. [all data]
Vejaphan, Hsieh, et al., 1988
Vejaphan, W.; Hsieh, T.C.Y.; Williams, S.S.,
Volatile flavor components from boiled crayfish (Procambarus clarkii) tail meat,
J. Food Sci., 1988, 53, 6, 1666-1670, https://doi.org/10.1111/j.1365-2621.1988.tb07811.x
. [all data]
Bianchi, Careri, et al., 2007
Bianchi, F.; Careri, M.; Mangia, A.; Musci, M.,
Retention indices in the analysis of food aroma volatile compounds in temperature-programmed gas chromatography: Database creation and evaluation of precision and robustness,
J. Sep. Sci., 2007, 39, 4, 563-572, https://doi.org/10.1002/jssc.200600393
. [all data]
Hallier, Prost, et al., 2005
Hallier, A.; Prost, C.; Serot, T.,
Influence in rearing conditions on the volatile compounds of cooked fillets of Silurus glanis (European catfish),
J. Agric. Food Chem., 2005, 53, 18, 7204-7211, https://doi.org/10.1021/jf050559o
. [all data]
Ranau and Steinhart, 2005
Ranau, R.; Steinhart, H.,
Identification and evaluation of volatile odor-active pollutants from different odor emission sources in the food industry,
Eur. Food Res. Technol., 2005, 220, 2, 226-231, https://doi.org/10.1007/s00217-004-1073-4
. [all data]
Munk, Johansen, et al., 2001
Munk, S.; Johansen, C.; Stahnke, L.H.; Adler-Nissen, J.,
Microbial survival and odor in laundry,
Journal of Surfactants and Detergents, 2001, 4, 4, 385-394, https://doi.org/10.1007/s11743-001-0192-2
. [all data]
Boatright and Lei, 1999
Boatright, W.L.; Lei, Q.,
Compounds contributing to the Beany odor of aqueous solutions of soy protein isolates,
J. Food Sci., 1999, 64, 4, 667-670, https://doi.org/10.1111/j.1365-2621.1999.tb15107.x
. [all data]
Baek and Cadwallader, 1996
Baek, H.H.; Cadwallader, K.R.,
Volatile compounds in flavor concentrates produced from crayfish-processing byproducts with and without protease treatment,
J. Agric. Food Chem., 1996, 44, 10, 3262-3267, https://doi.org/10.1021/jf960023q
. [all data]
Hofmann and Schieberle, 1995
Hofmann, T.; Schieberle, P.,
Evaluation of the key odorants in a thermally treated solution of ribose and cysteine by aroma extract dilution techniques,
J. Agric. Food Chem., 1995, 43, 8, 2187-2194, https://doi.org/10.1021/jf00056a042
. [all data]
Yasuhara, 1987
Yasuhara, A.,
Identification of Volatile Compounds in Poultry Manure by Gas Chromatography-Mass Spectrometry,
J. Chromatogr., 1987, 387, 371-378, https://doi.org/10.1016/S0021-9673(01)94539-X
. [all data]
Hillen and Werner, 1973
Hillen, L.W.; Werner, R.L.,
Correlation of retention index data for dimethyl polysulfides, polyselenides, and related thiaselena-alkanes,
J. Chromatogr., 1973, 79, 318-321, https://doi.org/10.1016/S0021-9673(01)85303-6
. [all data]
Goeminne, Vandendriessche, et al., 2012
Goeminne, P.C.; Vandendriessche, T.; Van Eldere, J.; Nicolai, B.M.; Hertog, M.L.; Dupont, L.J.,
Detection of Pseudomonas aeruginosa in sputum headspace through volatile organic compound analysis,
Respiratory Res., 2012, 13, 87, 1-9. [all data]
Kotowska, Zalikowski, et al., 2012
Kotowska, U.; Zalikowski, M.; Isidorov, V.A.,
HS-SPME/GC-MS analysis of volatile and semi-volatile organic compounds emitted from municipal sewage sludge,
Environ. Monit. Asses., 2012, 184, 5, 2893-2907, https://doi.org/10.1007/s10661-011-2158-8
. [all data]
Nawrath, Mgode, et al., 2012
Nawrath, T.; Mgode, G.F.; Weetjens, B.; Kaufmann, S.H.E.; Schulz, S.,
The volatiles of pathogenic and nonpathogenic mycobacteria aand related bacteria,
Beilstein J. Org. Chem., 2012, 8, 290-297, https://doi.org/10.3762/bjoc.8.31
. [all data]
Leffingwell and Alford, 2011
Leffingwell, J.; Alford, E.D.,
Volatile constituents of the giant pufball mushroom (Calvatia gigantea),
Leffingwell Rep., 2011, 4, 1-17. [all data]
Pino, Marquez, et al., 2010
Pino, J.A.; Marquez, E.; Quijano, C.E.; Castro, D.,
Volatile compounds in noni (Morinda citrifolia L.) at two ripening stages,
Ciencia e Technologia de Alimentos, 2010, 30, 1, 183-187, https://doi.org/10.1590/S0101-20612010000100028
. [all data]
Chen, Song, et al., 2009
Chen, G.; Song, H.; Ma, C.,
Aroma-active aompounds of Beijing roast duck,
Flavour Fragr. J., 2009, 24, 4, 186-191, https://doi.org/10.1002/ffj.1932
. [all data]
Blazevic and Mastelic, 2008
Blazevic, I.; Mastelic, J.,
Free and bounded volatiles of rocket (Eruca sativa Mill.),
Fravour Fragr. J., 2008, 23, 4, 278-285, https://doi.org/10.1002/ffj.1883
. [all data]
Breme, Langle, et al., 2008
Breme, K.; Langle, S.; Fernandez, X.; Meierhenrich, U.J.; Brevard, H.; Joulain, D.,
Character impact odorants from Brassicaceae by aroma extracts dilution analysis (AEDA): Brassica cretica and Brassica insularis,
Flavour Fragr. J., 2008, 24, 2, 88-93, https://doi.org/10.1002/ffj.1912
. [all data]
Pham, Schilling, et al., 2008
Pham, A.J.; Schilling, M.W.; Yoon, Y.; Kamadia, V.V.; Marshall, D.L.,
Characterization of fish sauce aroma-impact compounds using GC-MS, SPME-Osme-GCO, and Stevens' power law exponents,
J. Food. Sci., 2008, 73, 4, c268-c274, https://doi.org/10.1111/j.1750-3841.2008.00709.x
. [all data]
Rao, Nagender, et al., 2007
Rao, P.P.; Nagender, A.; Rao, L.J.; Rao, D.G.,
Studies on the effects of microwave drying and cabinet tray drying on the chemical composition of volatile oils of garlic powders,
Eur. Food Res. Technol., 2007, 224, 6, 791-795, https://doi.org/10.1007/s00217-006-0364-3
. [all data]
Fan and Qian, 2006
Fan, W.; Qian, M.C.,
Characterization of Aroma Compounds of Chinese Wuliangye and Jiannanchun Liquors by Aroma Extract Dilution Analysis,
J. Agric. Food Chem., 2006, 54, 7, 2695-2704, https://doi.org/10.1021/jf052635t
. [all data]
Iranshahi, Amin, et al., 2006
Iranshahi, M.; Amin, G.; Sourmaghi, M.S.; Shafiee, A.; Hadjiakhoondi, A.,
Sulphur-containing compounds in the essential oil of the root of Ferula persica Willd. var. persica,
Flavour Fragr. J., 2006, 21, 2, 260-261, https://doi.org/10.1002/ffj.1574
. [all data]
Bendimerad and Bendiab, 2005
Bendimerad, N.; Bendiab, S.A.T.,
Composition and antibacterial activity of Pseudocytisus integrifolius (Salisb.) essential oil from Algeria,
J. Agric. Food Chem., 2005, 53, 8, 2947-2952, https://doi.org/10.1021/jf047937u
. [all data]
Dickschat, Bode, et al., 2005
Dickschat, J.S.; Bode, H.B.; Wenzel, S.C.; Muller, R.; Schulz, S.,
Biosinthesis and Identification of Volatiles Released by the Myxobacterium Stigmatella aurantiaca,
ChemBioChem, 2005, 6, 11, 2023-2033, https://doi.org/10.1002/cbic.200500174
. [all data]
Dickschat, Martens, et al., 2005
Dickschat, J.S.; Martens, T.; Brinkhoff, T.; Simon, M.; Schulz, S.,
Volatiles released by a Streptomyces species isolated from the North Sea,
Chemistry and Biodiversity, 2005, 2, 7, 837-865, https://doi.org/10.1002/cbdv.200590062
. [all data]
Fan and Qian, 2005
Fan, W.; Qian, M.C.,
Headspace Solid Phase Microextraction and Gas Chromatography-Olfactometry Dilution Analysis of Young and Aged Chinese Yanghe Daqu Liquors,
J. Agric. Food Chem., 2005, 53, 20, 7931-7938, https://doi.org/10.1021/jf051011k
. [all data]
van Loon, Linssen, et al., 2005
van Loon, W.A.M.; Linssen, J.P.H.; Legger, A.; Posthumus, M.A.; Voragen, A.G.J.,
Identification and olfactometry of French fries flavour extracted at mouth conditions,
Food Chem., 2005, 90, 3, 417-425, https://doi.org/10.1016/j.foodchem.2004.05.005
. [all data]
Rohloff and Bones, 2005
Rohloff, J.; Bones, A.M.,
Volatile profiling of Arabidopsis thaliana - Putative olfactory compounds in plant communication,
Phytochemistry, 2005, 66, 16, 1941-1955, https://doi.org/10.1016/j.phytochem.2005.06.021
. [all data]
Valette, Fernandez, et al., 2003
Valette, L.; Fernandez, X.; Poulain, S.; Loiseau, A.-M.; Lizzani-Cuvelier, L.; Levieil, R.; Restier, L.,
Volatile constituents from Romanesco cauliflower,
Food Chem., 2003, 80, 3, 353-358, https://doi.org/10.1016/S0308-8146(02)00272-8
. [all data]
Jirovetz, Ngassoum, et al., 2002
Jirovetz, L.; Ngassoum, M.B.; Geissler, M.,
Analysis of the headspace aroma compounds of the seeds of the Cameroonian garlic plant Hua gabonii using SPME/GC/FID, SPME/GC/MS and olfactometry,
Eur. Food Res. Technol., 2002, 214, 3, 212-215, https://doi.org/10.1007/s00217-001-0481-y
. [all data]
Sanz, Czerny, et al., 2002
Sanz, C.; Czerny, M.; Cid, C.; Schieberle, P.,
Comparison of potent odorants in a filtered coffee brew and in an instant coffee beverage by aroma extract dilution analysis (AEDA),
Eur. Food Res. Technol., 2002, 214, 4, 299-302, https://doi.org/10.1007/s00217-001-0459-9
. [all data]
Suriyaphan, Drake, et al., 2001
Suriyaphan, O.; Drake, M.; Chen, X.Q.; Cadwallader, K.R.,
Characteristic aroma components of British farmhouse cheddar cheese,
J. Agric. Food Chem., 2001, 49, 3, 1382-1387, https://doi.org/10.1021/jf001121l
. [all data]
Tellez, Schrader, et al., 2001
Tellez, M.R.; Schrader, K.K.; Kobaisy, M.,
Volatile components of the cyanobacterium oscillatoria perornata (Skuja),
J. Agric. Food Chem., 2001, 49, 12, 5989-5992, https://doi.org/10.1021/jf010722p
. [all data]
Boylston and Viniyard, 1998
Boylston, T.D.; Viniyard, B.T.,
Isolation of volatile flavor compounds from peanut butter using purge-and-trap technique
in Instrumental Methods in Food and Beverage Analysis, D. Wetzel and G. Charalambous, ed(s)., 1998, 225-243. [all data]
Ding, Deng, et al., 1998
Ding, Q.; Deng, Y.; Sun, Y.; Huagn, A.; Sun, Y.,
Analysis of volatile components in ox feces by capillary gas chromatography,
Beijing Daxue Xuebao Ziran Kexueban, 1998, 34, 6, 720-725. [all data]
Kubec, Drhová, et al., 1998
Kubec, R.; Drhová, V.; Velísek, J.,
Thermal degradation of S-methylcysteine and its sulfoxide-important flavor precursors of Bassica and Allium vegetables,
J. Agric. Food Chem., 1998, 46, 10, 4334-4340, https://doi.org/10.1021/jf980379x
. [all data]
Buttery, Ling, et al., 1997
Buttery, R.G.; Ling, L.C.; Stern, D.J.,
Studies on popcorn aroma and flavor volatiles,
J. Agric. Food Chem., 1997, 45, 3, 837-843, https://doi.org/10.1021/jf9604807
. [all data]
Lopes, Godoy, et al., 1997
Lopes, D.; Godoy, R.L.O.; Goncalves, S.L.; Koketsu, M.; Oliveira, A.M.,
Sulphur constituents of the essential oil of Nira (Allium tuberosum Rottl.) cultivated in Brazil,
Flavour Fragr. J., 1997, 12, 4, 237-239, https://doi.org/10.1002/(SICI)1099-1026(199707)12:4<237::AID-FFJ644>3.0.CO;2-9
. [all data]
Rapior, Breheret, et al., 1997
Rapior, S.; Breheret, S.; Talou, T.; Bessiére, J.-M.,
Volatile flavor constituents of fresh Marasmius alliaceus (garlic Marasmius),
J. Agric. Food Chem., 1997, 45, 3, 820-825, https://doi.org/10.1021/jf960511y
. [all data]
Bellesia, Pinetti, et al., 1996
Bellesia, F.; Pinetti, A.; Bianchi, A.; Tirillini, B.,
Volatile compounds of the white truffle (Tuber magnaturn Pico) from middle Italy,
Flavour Fragr. J., 1996, 11, 4, 239-243, https://doi.org/10.1002/(SICI)1099-1026(199607)11:4<239::AID-FFJ573>3.0.CO;2-A
. [all data]
Milo and Grosch, 1996
Milo, C.; Grosch, W.,
Changes in the odorants of boiled salmon and cod as affected by the storage of the raw material,
J. Agric. Food Chem., 1996, 44, 8, 2366-2371, https://doi.org/10.1021/jf9507203
. [all data]
Hanum, Sinha, et al., 1995
Hanum, T.; Sinha, N.K.; Guyer, D.E.; Cash, J.N.,
Pyruvate and flavor development in macerated onions (Allium cepa L.) by γ-glutamyl transpeptidase and exogenous C-S lyase,
Food Chem., 1995, 54, 2, 183-188, https://doi.org/10.1016/0308-8146(95)00027-G
. [all data]
Milo and Grosch, 1995
Milo, C.; Grosch, W.,
Detection of odor defects in boiled cod and trout by gas chromatography-olfactometry of headspace samples,
J. Agric. Food Chem., 1995, 43, 2, 459-462, https://doi.org/10.1021/jf00050a038
. [all data]
Tamura, Nakamoto, et al., 1995
Tamura, H.; Nakamoto, H.; Yang, R.-H.; Sugisawa, H.,
Characteristic aroma compounds in green algae (Ulva pertusa) volatiles,
Nippon Shokuhin Kagaku Kogaku Kaishi, 1995, 42, 11, 887-891, https://doi.org/10.3136/nskkk.42.887
. [all data]
Yu and Ho, 1995
Yu, T.-H.; Ho, C.-T.,
Volatile compounds generated from thermal reaction of methionine and methionine sulfoxide with or without glucose,
J. Agric. Food Chem., 1995, 43, 6, 1641-1646, https://doi.org/10.1021/jf00054a043
. [all data]
Buttery, Stern, et al., 1994
Buttery, R.G.; Stern, D.J.; Ling, L.C.,
Studies on flavor volatiles of some sweet corn products,
J. Agric. Food Chem., 1994, 42, 3, 791-795, https://doi.org/10.1021/jf00039a038
. [all data]
Yu, Wu, et al., 1994
Yu, T.-H.; Wu, C.-M.; Rosen, R.T.; Hartman, T.G.; Ho, C.-T.,
Volatile compounds in generated from thermal degradation of alliin and deoxyalliin in an aqueous solution,
J. Agric. Food Chem., 1994, 42, 1, 146-153, https://doi.org/10.1021/jf00037a026
. [all data]
Güntert, Bertram, et al., 1992
Güntert, M.; Bertram, H.-J.; Hopp, R.; Silberzahn, W.; Sommer, H.; Werkhoff, P.,
Thermal generation of flavor compounds from thiamin and various amino acids
in Recent developments in flavor and fragrance chemistry. Proceedings of the 3rd International Haarmann Reimer Symposium, Hopp,R.; Mori,K., ed(s)., VCH Publishers, New York, 1992, 215-240. [all data]
Hansen, Buttery, et al., 1992
Hansen, M.; Buttery, R.G.; Stern, D.J.; Cantwell, M.I.; Ling, L.C.,
Broccoli storage under low-oxygen atmosphere: Identification of higher boiling volatiles,
J. Agric. Food Chem., 1992, 40, 5, 850-852, https://doi.org/10.1021/jf00017a029
. [all data]
Sinha, Guyer, et al., 1992
Sinha, N.K.; Guyer, D.E.; Gage, D.A.; Lira, C.T.,
Supercritical carbon dioxide extraction of onion flavors and their analysis by gas chromatography-mass spectrometry,
J. Agric. Food Chem., 1992, 40, 5, 842-845, https://doi.org/10.1021/jf00017a027
. [all data]
Drumm and Spanier, 1991
Drumm, T.D.; Spanier, A.M.,
Changes in the content of lipid autoxidation and sulfur-containing compounds in cooked beef during storage,
J. Agric. Food Chem., 1991, 39, 2, 336-343, https://doi.org/10.1021/jf00002a023
. [all data]
Misharina, Golovnya, et al., 1991
Misharina, T.A.; Golovnya, R.V.; Charnomskii, V.V.,
Volatile components of boiled shrimp funchalia woodwardi and crab geryon maritae,
Zh. Anal. Khim., 1991, 46, 1421-1429. [all data]
Sugisawa, Nakamura, et al., 1990
Sugisawa, H.; Nakamura, K.; Tamura, H.,
The aroma profile of the volatile in marine green algae (Ulva pertusa),
Food Reviews International, 1990, 6, 4, 573-589, https://doi.org/10.1080/87559129009540893
. [all data]
Flath, Matsumoto, et al., 1989
Flath, R.A.; Matsumoto, K.E.; Binder, R.G.; Cunningham, R.T.; Mon, T.R.,
Effect of pH on the volatiles of hydrolyzed protein insect baits,
J. Agric. Food Chem., 1989, 37, 3, 814-819, https://doi.org/10.1021/jf00087a053
. [all data]
Kurashov, Mitrukova, et al., 2014
Kurashov, E.A.; Mitrukova, G.G.; Krylova, Yu.V.,
Variations in the component composition of essential oil of Ceratophyllum demersum (Ceratophyllaceae) during vegetation (in press),
Plant Resources (Rastitel'nye Resursy), 2014, 1, 000-000. [all data]
Robinson, Adams, et al., 2012
Robinson, A.L.; Adams, D.O.; Boss, P.K.; Heymann, H.; Solomon, P.S.; Trengove, R.D.,
Influence of geographic origine on the sensory characteristics and wine composition of Vitus viniferas cv. Cabernet Sauvignon wines from Australia (Supplemental data),
Am. J. Enol. Vitic., 2012, 64, 4, 467-476, https://doi.org/10.5344/ajev.2012.12023
. [all data]
Christlbauer and Schieberle, 2009
Christlbauer, M.; Schieberle, P.,
Characterization of the key aroma compounds in beef and pork vegetable gravies a la chef by application of the aroma extract dilution analysis,
J. Agric. Food Chem., 2009, 57, 19, 9114-9112, https://doi.org/10.1021/jf9023189
. [all data]
Rotsatschakul, Visesanguan, et al., 2009
Rotsatschakul, P.; Visesanguan, W.; Smitinont, T.; Chaiseri, S.,
Changes in volatile compounds during fermentation of nham (Thai fermented sausage),
Int. Food Res. J., 2009, 16, 391-414. [all data]
Frauendorfer and Schieberle, 2008
Frauendorfer, F.; Schieberle, P.,
Changes in key aroma compounds of criollo cocoa beans during roasting,
J. Agric. Food Chem., 2008, 56, 21, 10244-10251, https://doi.org/10.1021/jf802098f
. [all data]
Staples and Zeiger, 2008
Staples, E.; Zeiger, K.,
On-Site Measurements of VOCs and Odors from Metal Casting Operations Using an Ultra-Fast Gas Chromatograph, 2008, retrieved from http://www.estcal.com/TechPapers/Industrial/FoundryOdors.doc. [all data]
Liu, Xu, et al., 2007
Liu, Y.; Xu, X.-L.; Zhou, G.-H.,
Comparative study of volatile compounds in traditional Chinese Nanjing marinated duck by different extraction techniques,
Int. J. Food Sci. Technol., 2007, 42, 5, 543-550, https://doi.org/10.1111/j.1365-2621.2006.01264.x
. [all data]
Splivallo, Bossi, et al., 2007
Splivallo, R.; Bossi, S.; Maffei, M.; Bonfante, P.,
Discrimination of truffle fruiting body versus mycelial aromas by stir bar sorptive extraction,
Phytochemistry, 2007, 68, 20, 2584-2598, https://doi.org/10.1016/j.phytochem.2007.03.030
. [all data]
Callemien, Dasnoy, et al., 2006
Callemien, D.; Dasnoy, S.; Collin, S.,
Identification of a stale-beer-like odorant in extracts of naturally aged beer,
J. Agric. Food Chem., 2006, 54, 4, 1409-1413, https://doi.org/10.1021/jf051772n
. [all data]
Chantreau, Rochat, et al., 2006
Chantreau, A.; Rochat, S.; de Saint Laumer, J.-Y.,
Re-investigation of sulfur impact odorants in roast beef using comprehensive two-dimensional GC-TOF-MS and the GC-SNIF,
Developments Food. Sci., 2006, 43, 601-604. [all data]
Pyun and Shin, 2006
Pyun, M.-S.; Shin, S.,
Antifungal effects of the volatile oils from Allium plants against Trichophyton species and synergism of the oils with ketoconazole,
Phytomedicine, 2006, 13, 6, 394-400, https://doi.org/10.1016/j.phymed.2005.03.011
. [all data]
Callamien, Dasnoy, et al., 2005
Callamien, D.; Dasnoy, S.; Heynen, O.; Badot, C.; Collin, S.,
Flavour stability of lager beer: identification of a new key staling compounds,
Eur. Brewery Convention, 2005, 91, 815-822. [all data]
Callemien, Dasnoy, et al., 2005
Callemien, D.; Dasnoy, S.; Heynen, O.; Badot, C.; Collin, S.,
Flavour stability of lager beer: identification of a new key staling compound
in European Brewery Convention, Fachverlag Hans Carl, Nurnberg, Germany, 2005, 815-822. [all data]
Thierry, Maillard, et al., 2005
Thierry, A.; Maillard, M.-B.; Bonnarme, P.; Roussel, E.,
The addition of Propionibacterium freudenreichii to raclette cheese induces biochemical changes and enhances flavor development,
J. Agric. Food Chem., 2005, 53, 10, 4157-4165, https://doi.org/10.1021/jf0481195
. [all data]
Counet, Ouwerx, et al., 2004
Counet, C.; Ouwerx, C.; Rosoux, D.; Collin, S.,
Relationship between procyanidin and flavor contents of cocoa liquors from different origins,
J. Agric. Food Chem., 2004, 52, 20, 6243-6249, https://doi.org/10.1021/jf040105b
. [all data]
Garcia-Estaban, Ansorena, et al., 2004
Garcia-Estaban, M.; Ansorena, D.; Astiasaran, I.; Martin, D.; Ruiz, J.,
Comparison of simultaneous distillation extraction (SDE) and solid-phase microextraction (SPME) for the analysis of volatile compounds in dry-cured ham,
J. Sci. Food Agric., 2004, 84, 11, 1364-1370, https://doi.org/10.1002/jsfa.1826
. [all data]
Machiels, Istasse, et al., 2004
Machiels, D.; Istasse, L.; van Ruth, S.M.,
Gas chromatography-olfactometry analysis of beef meat originating from differently fed Belgian Blue, Limousin and Aberdeen Angus bulls,
Food Chem., 2004, 86, 3, 377-383, https://doi.org/10.1016/j.foodchem.2003.09.011
. [all data]
Begnaud, Pérès, et al., 2003
Begnaud, F.; Pérès, C.; Berdagué, J.-L.,
Characterization of volatile effluents of livestock buildings by solid-phase microextraction,
Int. J. Environ. Anal. Chem., 2003, 83, 10, 837-849, https://doi.org/10.1080/03067310310001603349
. [all data]
Machiels and Istasse, 2003
Machiels, D.; Istasse, L.,
Evaluation of two commercial solid-phase microextraction fibres for the analysis of target aroma compounds in cooked beef meat,
Talanta, 2003, 61, 4, 529-537, https://doi.org/10.1016/S0039-9140(03)00319-9
. [all data]
Machiels, van Ruth, et al., 2003
Machiels, D.; van Ruth, S.M.; Posthumus, M.A.; Istasse, L.,
Gas chromatography-olfactometry analysis of the volatile compounds of two commercial Irish beef meats,
Talanta, 2003, 60, 4, 755-764, https://doi.org/10.1016/S0039-9140(03)00133-4
. [all data]
Qian and Reineccius, 2003
Qian, M.; Reineccius, G.,
Potent aroma compounds in Parmigiano Reggiano cheese studied using a dynamic headspace (purge-trap) method,
Flavour Fragr. J., 2003, 18, 3, 252-259, https://doi.org/10.1002/ffj.1194
. [all data]
Counet, Callemien, et al., 2002
Counet, C.; Callemien, D.; Ouwerx, C.; Collin, S.,
Use of gas chromatography-olfactometry to identify key odorant compounds in dark chocolate. Comparison of samples before and after conching,
J. Agric. Food Chem., 2002, 50, 8, 2385-2391, https://doi.org/10.1021/jf0114177
. [all data]
Gijs, Chevanese, et al., 2002
Gijs, L.; Chevanese, F.; Jerkovic, V.; Collin, S.,
How low pH can intensify beta-damascenone and dimethyl trisulfide production through beer aging,
J. Agric. Food Chem., 2002, 50, 20, 5612-5616, https://doi.org/10.1021/jf020563p
. [all data]
Landy, Boucon, et al., 2002
Landy, P.; Boucon, C.; Kooyman, G.M.; Musters, P.A.D.; Rosin, E.A.E.; de Joode, T.; Laan, J.; Haring, P.G.M.,
Sensory and chemical changes in tomato sauces during storage,
J. Agric. Food Chem., 2002, 50, 11, 3262-3271, https://doi.org/10.1021/jf011249i
. [all data]
Lermusieau, Bulens, et al., 2001
Lermusieau, G.; Bulens, M.; Collin, S.,
Use of GC-olfactometry to identify the hop aromatic compounds in beer,
J. Agric. Food Chem., 2001, 49, 8, 3867-3874, https://doi.org/10.1021/jf0101509
. [all data]
Luo and Agnew, 2001
Luo, J.; Agnew, M.P.,
Gas characteristics before and after biofiltration treating odorous emissions from animal rendering processes,
Environ. Technol., 2001, 22, 9, 1091-1103, https://doi.org/10.1080/09593332208618220
. [all data]
Schieberle and Steinhaus, 2001
Schieberle, P.; Steinhaus, M.,
Characterization of the odor-active constituents in fresh and processed hops (variety Spalter select),
Am. Chem. Soc. Symp. Ser., 2001, 782, 23-32. [all data]
Gijs, Piraprez, et al., 2000
Gijs, L.; Piraprez, G.; Perpète, P.; Spinnler, E.; Collin, S.,
Retention of sulfur flavours by food matrix and determination of sensorial data independent of the medium composition,
Food Chem., 2000, 69, 3, 319-330, https://doi.org/10.1016/S0956-7135(99)00111-5
. [all data]
Tirillini, Verdelli, et al., 2000
Tirillini, B.; Verdelli, G.; Paolocci, F.; Ciccioli, P.; Frattoni, M.,
The volatile organic compounds from the mycelium of Tuber borchii Vitt.,
Phytochemistry, 2000, 55, 8, 983-985, https://doi.org/10.1016/S0031-9422(00)00308-3
. [all data]
Masanetz, Guth, et al., 1998
Masanetz, C.; Guth, H.; Grosch, W.,
Fishy and hay-like off-flavours of dry spinach,
Z. Lebensm. Unters. Forsch. A, 1998, 206, 2, 108-113, https://doi.org/10.1007/s002170050224
. [all data]
Matsui, Guth, et al., 1998
Matsui, T.; Guth, H.; Grosch, W.,
A comparative study of potent odorants in peanut, hazelnut, and pumpkin seed oils on the basis of aroma extract dilution analysis (AEDA) and gas chromatography-olfactometry of headspace samples (GCOH),
Lipid - Fett, 1998, 100, 2, 51-56, https://doi.org/10.1002/(SICI)1521-4133(199802)100:2<51::AID-LIPI51>3.0.CO;2-W
. [all data]
Zehentbauer and Grosch, 1998
Zehentbauer, G.; Grosch, W.,
Crust aroma of baguettes. I. Key odorants of baguettes prepared in two different ways,
J. Cereal Science, 1998, 28, 1, 81-92, https://doi.org/10.1006/jcrs.1998.0184
. [all data]
Guth, 1997
Guth, H.,
Identification of character impact odorants of different white wine varieties,
J. Agric. Food Chem., 1997, 45, 8, 3022-3026, https://doi.org/10.1021/jf9608433
. [all data]
Schermann and Schieberle, 1997
Schermann, P.; Schieberle, P.,
Evaluation of key odorants in milk chocolate and cocoa mass by aroma extract dilution analyses,
J. Agric. Food Chem., 1997, 45, 3, 867-872, https://doi.org/10.1021/jf960670h
. [all data]
Mateo and Zumalacárregui, 1996
Mateo, J.; Zumalacárregui, J.M.,
Volatile compounds in chorizo and their changes during ripening,
Meat Sci., 1996, 44, 4, 255-273, https://doi.org/10.1016/S0309-1740(96)00028-9
. [all data]
Misharina, 1995
Misharina, T.A.,
Sorption regularities of sulfur- and oxygen-containing compounds in chromatography and their application in identification of volatile organic compounds, Diss. degree of Dr. Sci. (Chemistry), 1995, 52. [all data]
Guth and Grosch, 1994
Guth, H.; Grosch, W.,
Identification of the character impact odorants of stewed beef juice by instrumental analyses and sensory studies,
J. Agric. Food Chem., 1994, 42, 12, 2862-2866, https://doi.org/10.1021/jf00048a039
. [all data]
Buttery, Teranishi, et al., 1990
Buttery, R.G.; Teranishi, R.; Flath, R.A.; Ling, L.C.,
Identification of additional tomato paste volatiles,
J. Agric. Food Chem., 1990, 38, 3, 792-795, https://doi.org/10.1021/jf00093a042
. [all data]
Blank, Fischer, et al., 1989
Blank, I.; Fischer, K.-H.; Grosch, W.,
Intensive neutral odourants of linden honey,
Z. Lebensm. Unters. Forsch., 1989, 189, 5, 426-433, https://doi.org/10.1007/BF01028316
. [all data]
Schultz, Flath, et al., 1988
Schultz, T.H.; Flath, R.A.; Stern, D.J.; Mon, T.R.; Teranishi, R.; McKenna Kruse, S.; Butlder, B.; Howard, W.E.,
Coyote estrous urine volatiles,
J. Chem. Ecol., 1988, 14, 2, 701-712, https://doi.org/10.1007/BF01013917
. [all data]
Waggott and Davies, 1984
Waggott, A.; Davies, I.W.,
Identification of organic pollutants using linear temperature programmed retention indices (LTPRIs) - Part II, 1984, retrieved from http://dwi.defra.gov.uk/research/completed-research/reports/dwi0383.pdf. [all data]
Puvipirom and Chaisei, 2012
Puvipirom, J.; Chaisei, S.,
Contribution of roasted grains and seeds in aroma of oleang (Thai coffee drink),
Int. Food Res. J., 2012, 19, 2, 583-588. [all data]
Kumazawa, Sakai, et al., 2010
Kumazawa, K.; Sakai, N.; Amma, H.; Sakamoto, S.; Kodama, M.; Wada, Y.; Nishimura, O.,
Identification and formation of volatile components responsible for the characteristic aroma of Mat Rush (Igusa),
Biosci. Biotechnol. Biochem., 2010, 74, 6, 1231-1236, https://doi.org/10.1271/bbb.100053
. [all data]
Rochat, Egger, et al., 2009
Rochat, S.; Egger, J.; Chaintreau, A.,
Strategy for the identification of key odorants: application to shrimp aroma,
J. Chromatogr. A, 2009, 1216, 36, 6424-6432, https://doi.org/10.1016/j.chroma.2009.07.014
. [all data]
Soria, Sanz, et al., 2008
Soria, A.C.; Sanz, J.; Martinez-Castro, I.,
SPME followed by GC-MS: a powerful technique for qualitative analysis of honey volatiles,
Eur. Food Res. Technol., 2008, 1-12. [all data]
Spadone, Matthey-Doret, et al., 2006
Spadone, J.-C.; Matthey-Doret, W.; Blank, I.,
Formation of methyl(methylthio)methyl disulfide in broccoli (Brassica oleracea (L.) var. italica)
in Flavour Science: Recent Advances and Trends, Bredie, W.L.P.; Petersen, M.A., ed(s)., Elsevier, Amsterdam, 2006, 309-314. [all data]
Wierda R.L., Fletcher G., et al., 2006
Wierda R.L.; Fletcher G.; Xu L.; Dufour J.P.,
Analysis of volatile compounds as spoilage indicators in fresh king salmon (Oncorhynchus tshawytscha) during storage using SPME-GC-MS,
J. Agric. Food Chem., 2006, 54, 22, 8480-8490, https://doi.org/10.1021/jf061377c
. [all data]
de la Fuente, Martinez-Castro, et al., 2005
de la Fuente, E.; Martinez-Castro, I.; Sanz, J.,
Characterization of Spanish unifloral honeys by solid phase microextraction and gas chromatography-mass spectrometry,
J. Sep. Sci., 2005, 28, 9-10, 1093-1100, https://doi.org/10.1002/jssc.200500018
. [all data]
Ishizaki, Tachihara, et al., 2005
Ishizaki, S.; Tachihara, T.; Tamura, H.; Yanai, T.; Kitahara, T.,
Evaluation of odour-active compounds in roasted shrimp (Sergia lucens Hansen) by aroma extract dilution analysis,
Flavour Fragr. J., 2005, 20, 6, 562-566, https://doi.org/10.1002/ffj.1484
. [all data]
Isogai, Utsunomiya, et al., 2005
Isogai, A.; Utsunomiya, H.; Kanda, R.; Iwata, H.,
Changes in the Aroma Compounds of Sake during Aging,
J. Agric. Food Chem., 2005, 53, 10, 4118-4123, https://doi.org/10.1021/jf047933p
. [all data]
Culleré, Escudero, et al., 2004
Culleré, L.; Escudero, A.; Cacho, J.; Ferreira, V.,
Gas chromatography-olfactometry and chemical quantitative study of the aroma of six premium auality Spanish aged red wines,
J. Agric. Food Chem., 2004, 52, 6, 1653-1660, https://doi.org/10.1021/jf0350820
. [all data]
Ishikawa, Ito, et al., 2004
Ishikawa, M.; Ito, O.; Ishizaki, S.; Kurobayashi, Y.; Fujita, A.,
Solid-phase aroma concentrate extraction (SPACE ): a new headspace technique for more sensitive analysis of volatiles,
Flavour Fragr. J., 2004, 19, 3, 183-187, https://doi.org/10.1002/ffj.1322
. [all data]
Soria, Gonzalez, et al., 2004
Soria, A.C.; Gonzalez, M.; de Lorenzo, C.; Martinez-Castro, I.; Sanza, J.,
Characterization of artisanal honeys from Madrid (Central Spain) on the basis of their melissopalynological, physicochemical and volatile composition data,
Food Chem., 2004, 85, 1, 121-130, https://doi.org/10.1016/j.foodchem.2003.06.012
. [all data]
López, Ortín, et al., 2003
López, R.; Ortín, N.; Pérez-Trujillo, J.P.; Cacho, J.; Ferreira, V.,
Impact odorants of different young white wines from the Canary islands,
J. Agric. Food Chem., 2003, 51, 11, 3419-3425, https://doi.org/10.1021/jf026045w
. [all data]
Fukami, Ishiyama, et al., 2002
Fukami, K.; Ishiyama, S.; Yaguramaki, H.; Masuzawa, T.; Nabeta, Y.; Endo, K.; Shimoda, M.,
Identification of distinctive volatile compounds in fish sauce,
J. Agric. Food Chem., 2002, 50, 19, 5412-5416, https://doi.org/10.1021/jf020405y
. [all data]
Lecanu, Ducruet, et al., 2002
Lecanu, L.; Ducruet, V.; Jouquand, C.; Gratadoux, J.J.; Feigenbaum, A.,
Optimization of headspace solid-phase microextraction (SPME) for the odor analysis of surface-ripened cheese,
J. Agric. Food Chem., 2002, 50, 13, 3810-3817, https://doi.org/10.1021/jf0117107
. [all data]
Qian and Reineccius, 2002
Qian, M.; Reineccius, G.,
Identification of aroma compounds in Parmigiano-Reggiano cheese by gas chromatography/olfactometry,
J. Dairy Sci., 2002, 85, 6, 1362-1369, https://doi.org/10.3168/jds.S0022-0302(02)74202-1
. [all data]
Bendall, 2001
Bendall, J.G.,
Aroma compounds of fresh milk from New Zealand cows fed different diets,
J. Agric. Food Chem., 2001, 49, 10, 4825-4832, https://doi.org/10.1021/jf010334n
. [all data]
Chyau and Mau, 2001
Chyau, C.-C.; Mau, J.-L.,
Effects of various oils on volatile compounds of deep-fried shallot flavouring,
Food Chem., 2001, 74, 1, 41-46, https://doi.org/10.1016/S0308-8146(00)00336-8
. [all data]
Kumazawa and Masuda, 2001
Kumazawa, K.; Masuda, H.,
Change in the flavor of black tea drink during heat processing,
J. Agric. Food Chem., 2001, 49, 7, 3304-3309, https://doi.org/10.1021/jf001323h
. [all data]
Girard and Durance, 2000
Girard, B.; Durance, T.,
Headspace volatiles of sockeye and pink salmon as affected by retort process,
Food Chem. Toxicol., 2000, 65, 1, 34-39. [all data]
Buttery, Orts, et al., 1999
Buttery, R.G.; Orts, W.J.; Takeoka, G.R.; Nam, Y.,
Volatile flavor components of rice cakes,
J. Agric. Food Chem., 1999, 47, 10, 4353-4356, https://doi.org/10.1021/jf990140w
. [all data]
Chyau and Mau, 1999
Chyau, C.-C.; Mau, J.-L.,
Release of volatile compounds from microwave heating of garlic juice with 2,4-decadienals,
Food Chem., 1999, 64, 4, 531-535, https://doi.org/10.1016/S0308-8146(98)00162-9
. [all data]
Iwatsuki, Mizota, et al., 1999
Iwatsuki, K.; Mizota, Y.; Kubota, T.; Nishimura, O.; Masuda, H.; Sotoyama, K.; Tomita, M.,
Aroma extract dilution analysis. Evluation of aroma of pasteurized and UHT processed milk by aroma extract dilution analysis,
Nippon Shokuhin Kagaku Kogaku Kaishi, 1999, 46, 9, 587-597, https://doi.org/10.3136/nskkk.46.587
. [all data]
Buttery and Ling, 1998
Buttery, R.G.; Ling, L.C.,
Additional studies on flavor components of corn tortilla chips,
J. Agric. Food Chem., 1998, 46, 7, 2764-2769, https://doi.org/10.1021/jf980125b
. [all data]
Chyau, Lin, et al., 1997
Chyau, C.-C.; Lin, Y.-C.; Mau, J.-L.,
Storage stability of deep-fried shallot flavoring,
J. Agric. Food Chem., 1997, 45, 8, 3211-3215, https://doi.org/10.1021/jf970109z
. [all data]
Takeoka, Buttery, et al., 1991
Takeoka, G.R.; Buttery, R.G.; Teranishi, R.; Flath, R.A.; Güntert, M.,
Identification of additional pineapple volatiles,
J. Agric. Food Chem., 1991, 39, 10, 1848-1851, https://doi.org/10.1021/jf00010a032
. [all data]
Tressl and Silwar, 1981
Tressl, R.; Silwar, R.,
Investigation of sulfur-containing components in roasted coffee,
J. Agric. Food Chem., 1981, 29, 5, 1078-1082, https://doi.org/10.1021/jf00107a045
. [all data]
Delabre and Bendall, 9999
Delabre, M.-L.; Bendall, J.F.,
Flavour ingredients from fermented dairy streams,
Expression of Multidisciplinary Flavour Sci., 9999, 375-378. [all data]
Tao, Wenlai, et al., 2008
Tao, L.; Wenlai, F.; Yan, X.,
Characterization of volatile and semi-volatile compounds in Chinese rica wines by headspace solid phase microextraction followed by gas chromatography - mass spectrometry,
J. Inst. Brew., 2008, 114, 2, 172-179, https://doi.org/10.1002/j.2050-0416.2008.tb00323.x
. [all data]
Berard, Bianchi, et al., 2007
Berard, J.; Bianchi, F.; Careri, M.; Chatel, A.; Mangia, A.; Musci, M.,
Characterization of the volatile fraction and of free fatty acids of Fontina Valle d'Aosta, a protected designation of origin Italian cheese,
Food Chem., 2007, 105, 1, 293-300, https://doi.org/10.1016/j.foodchem.2006.11.041
. [all data]
Gyawalia, Seo, et al., 2006
Gyawalia, R.; Seo, H.-Y.; Lee, H.-J.; Song, H.-P.; Kim, D.-H.; Byun, M.-W.; Kim, K.-S.,
Effect of γ-irradiation on volatile compounds of dried Welsh onion (Allium fistulosum L.),
Radiat. Phys. Chem., 2006, 75, 2, 322-328, https://doi.org/10.1016/j.radphyschem.2005.07.001
. [all data]
Editorial paper, 2005
Editorial paper,
Solid Phase Microextraction (SPME) Application Guide,
The Reporter Europe (Supelco), 2005, 16, 5, 12-12. [all data]
Kraft and Switt, 2005
Kraft, P.; Switt, K.A.D. (Eds),
Perspectives in Flavor and Fragrance Research, Wiley-VCH, Weinheim, Germany, 2005, 251. [all data]
Kim. J.H., Ahn, et al., 2004
Kim. J.H.; Ahn, H.J.; Yook, H.S.; Kim, K.S.; Rhee, M.S.; Ryu, G.H.; Byun, M.W.,
Color, flavor, and sensory characteristics of gamma-irradiated salted and fermented anchovy sauce,
Radiation Phys. Chem., 2004, 69, 2, 179-187, https://doi.org/10.1016/S0969-806X(03)00400-6
. [all data]
Tachihara, Ishizaki, et al., 2004
Tachihara, T.; Ishizaki, S.; Ishikawa, M.; Kitahara, T.,
Studies on the volatile compounds of roasted spotted shrimp,
Chemistry Biodiversity, 2004, 1, 12, 2024-2033, https://doi.org/10.1002/cbdv.200490155
. [all data]
Baek and Cadwallader, 2003
Baek, H.H.; Cadwallader, K.R.,
Gas chromatographic/olfactometric evaluation of flavor extracts produced from crawfish processing by-products, 2003, retrieved from http://nsgl.gso.uri.edu/source/flsgpw95001/flsgpw95001part5.pdf. [all data]
Muresan, Eillebrecht, et al., 2000
Muresan, S.; Eillebrecht, M.A.J.L.; de Rijk, T.C.; de Jonge, H.G.; Leguijt, T.; Nijhuis, H.H.,
Aroma profile development of intermediate chocolate products. I. Volatile constituents of block-milk,
Food Chem., 2000, 68, 2, 167-174, https://doi.org/10.1016/S0308-8146(99)00171-5
. [all data]
Forney and Jordan, 1998
Forney, C.F.; Jordan, M.A.,
Induction of volatile compounds in broccoli by postharvest hot-water dips,
J. Agric. Food Chem., 1998, 46, 12, 5295-5301, https://doi.org/10.1021/jf980443a
. [all data]
Patterson and Stevenson, 1995
Patterson, R.L.S.; Stevenson, M.H.,
Irradiation-induced off-odor in chicken and its possible control,
British Poultry Science, 1995, 36, 3, 425-441, https://doi.org/10.1080/00071669508417789
. [all data]
Luning, de Rijk, et al., 1994
Luning, P.A.; de Rijk, T.; Wichers, H.J.; Roozen, J.P.,
Gas chromatography, mass spectrometry, and sniffing port analyses of volatile compounds of fresh bell peppers (Capsicum annuum) at different ripening stages,
J. Agric. Food Chem., 1994, 42, 4, 977-983, https://doi.org/10.1021/jf00040a027
. [all data]