(E)-5-Azahepta-2,4-diene
- Formula: C6H11N
- Molecular weight: 97.1582
- IUPAC Standard InChIKey: RKNWIPJTFNGBHD-TWTPFVCWSA-N
- CAS Registry Number: 3653-19-8
- Chemical structure:
View 3d structure (requires JavaScript / HTML 5) - Permanent link for this species. Use this link for bookmarking this species for future reference.

Gas phase ion energetics data

Data compiled as indicated in comments:
LLK - Sharon G. Lias, Rhoda D. Levin, and Sherif A. Kafafi
Ionization energy determinations
IE (eV) | Method | Reference | Comment |
---|---|---|---|
8.9 | PE | Vocelle, Dargelos, et al., 1977 | LLK |
9.3 | PE | Vocelle, Dargelos, et al., 1977 | Vertical value; LLK |

References

Vocelle, Dargelos, et al., 1977
Vocelle, D.; Dargelos, A.; Pottier, R.; Sandorfy, C.,
Photoelectron and far-ultraviolet absorption spectra of nonaromatic azomethine compounds,
J. Chem. Phys., 1977, 66, 2860. [all data]