Bicyclo[2.2.2]oct-2-ene,5,6-bis(methylene)-
- Formula: C10H12
- Molecular weight: 132.2023
- IUPAC Standard InChIKey: FGUYOMZFYKDVOZ-UHFFFAOYSA-N
- CAS Registry Number: 36528-62-8
- Chemical structure:
View 3d structure (requires JavaScript / HTML 5) - Permanent link for this species. Use this link for bookmarking this species for future reference.

Gas phase ion energetics data

Data compiled by: Sharon G. Lias, Rhoda D. Levin, and Sherif A. Kafafi
Ionization energy determinations
IE (eV) | Method | Reference | Comment |
---|---|---|---|
8.33 ± 0.03 | PE | Pfeffer, Klessinger, et al., 1975 | Vertical value |
8.33 | PE | Asmus and Klessinger, 1974 | Vertical value |

References

Pfeffer, Klessinger, et al., 1975
Pfeffer, H.-U.; Klessinger, M.; Erker, G.; Roth, W.R.,
Photoelektronenspektren organischer Verbindungen, VIII 7,8-Dimethylenbicyclo[2.2.2]octa-2,5-dien und verwandte Verbindungen,
Chem. Ber., 1975, 108, 2923. [all data]
Asmus and Klessinger, 1974
Asmus, P.; Klessinger, M.,
Photoelectron spectra of organic compounds. VI. Exocyclic methylene compounds,
Tetrahedron, 1974, 30, 2477. [all data]