2,3-Diazabicyclo[2.2.2]oct-2-ene 2,3-dioxide
- Formula: C6H10N2O2
- Molecular weight: 142.1558
- IUPAC Standard InChIKey: KQTDJBAPOKEJFF-UHFFFAOYSA-N
- CAS Registry Number: 36479-80-8
- Chemical structure:
View 3d structure (requires JavaScript / HTML 5) - Permanent link for this species. Use this link for bookmarking this species for future reference.

Gas phase ion energetics data

Data compiled by: Sharon G. Lias, Rhoda D. Levin, and Sherif A. Kafafi
Ionization energy determinations
IE (eV) | Method | Reference |
---|---|---|
8.04 ± 0.03 | PE | Bunzli, Olsen, et al., 1977 |

References

Bunzli, Olsen, et al., 1977
Bunzli, J.-C.G.; Olsen, H.; Snyder, J.P.,
Photoelectron spectra of bicyclic azo N-oxides and azo N, N'-dioxides,
J. Org. Chem., 1977, 42, 614. [all data]