Bicyclo[2.2.1]hepta-2,5-diene, 7-(1-methylethylidene)
- Formula: C10H12
- Molecular weight: 132.2023
- IUPAC Standard InChIKey: DJJCBYBODUZWKD-UHFFFAOYSA-N
- CAS Registry Number: 36456-22-1
- Chemical structure:
View 3d structure (requires JavaScript / HTML 5) - Permanent link for this species. Use this link for bookmarking this species for future reference.

Gas phase ion energetics data

Data compiled as indicated in comments:
LLK - Sharon G. Lias, Rhoda D. Levin, and Sherif A. Kafafi
Ionization energy determinations
IE (eV) | Method | Reference | Comment |
---|---|---|---|
7.97 | PE | Heilbronner and Martin, 1972 | LLK |

References

Heilbronner and Martin, 1972
Heilbronner, E.; Martin, H.D.,
The π-orbital sequence in norbornadiene and related hydrocarbons,
Helv. Chim. Acta, 1972, 55, 1490. [all data]