Bicyclo[2.2.2]octane,2,3-bis(methylene)-
- Formula: C10H14
- Molecular weight: 134.2182
- IUPAC Standard InChIKey: WEOIMVGRKQBCKD-UHFFFAOYSA-N
- CAS Registry Number: 36439-79-9
- Chemical structure:
View 3d structure (requires JavaScript / HTML 5) - Permanent link for this species. Use this link for bookmarking this species for future reference.

Gas phase ion energetics data

Data compiled by: Sharon G. Lias, Rhoda D. Levin, and Sherif A. Kafafi
Ionization energy determinations
IE (eV) | Method | Reference | Comment |
---|---|---|---|
8.37 | PE | Asmus and Klessinger, 1974 | Vertical value |

References

Asmus and Klessinger, 1974
Asmus, P.; Klessinger, M.,
Photoelectron spectra of organic compounds. VI. Exocyclic methylene compounds,
Tetrahedron, 1974, 30, 2477. [all data]