Bicyclo[2.2.1]heptane, 2,3-bis(methylene)-
- Formula: C9H12
- Molecular weight: 120.1916
- IUPAC Standard InChIKey: GUBNJQWOCZEVSJ-UHFFFAOYSA-N
- CAS Registry Number: 36439-78-8
- Chemical structure:
View 3d structure (requires JavaScript / HTML 5) - Species with the same structure:

Gas phase ion energetics data

Data compiled as indicated in comments:
LL - Sharon G. Lias and Joel F. Liebman
LLK - Sharon G. Lias, Rhoda D. Levin, and Sherif A. Kafafi
Ionization energy determinations
IE (eV) | Method | Reference | Comment |
---|---|---|---|
8.41 | PE | Werstiuk, Clark, et al., 1990 | Vertical value; LL |
8.41 | PE | Asmus and Klessinger, 1974 | Vertical value; LLK |

References

Werstiuk, Clark, et al., 1990
Werstiuk, N.H.; Clark, K.B.; Leigh, W.J.,
Conformational analysis and structure elucidation of 2,3-dimethyl and 2,4-dimethyl-2,4-hexadienes by AM1 and He(I) ultraviolet photoelectron spectroscopy,
Can. J. Chem., 1990, 68, 2078. [all data]
Asmus and Klessinger, 1974
Asmus, P.; Klessinger, M.,
Photoelectron spectra of organic compounds. VI. Exocyclic methylene compounds,
Tetrahedron, 1974, 30, 2477. [all data]