Nitroethylene
- Formula: C2H3NO2
- Molecular weight: 73.0507
- IUPAC Standard InChIKey: RPMXALUWKZHYOV-UHFFFAOYSA-N
- CAS Registry Number: 3638-64-0
- Chemical structure:
View 3d structure (requires JavaScript / HTML 5) - Species with the same structure:

Phase change data

Data compiled by: Robert L. Brown and Stephen E. Stein
Quantity | Value | Units | Method | Reference | Comment |
---|---|---|---|---|---|
Tboil | 371.7 | K | N/A | Weast and Grasselli, 1989 |

Reaction thermochemistry data

Data compiled by: John E. Bartmess
Individual Reactions
C2H2NO2- + =
By formula: C2H2NO2- + H+ = C2H3NO2
Quantity | Value | Units | Method | Reference | Comment |
---|---|---|---|---|---|
ΔrH° | 1515. ± 19. | kJ/mol | EIAE | Shiga, Yamaoka, et al., 1972 | gas phase; From CH2=CHNO2 |
ΔrH° | <1563.1 | kJ/mol | G+TS | Bartmess, 1980 | gas phase |
Quantity | Value | Units | Method | Reference | Comment |
ΔrG° | 1483. ± 22. | kJ/mol | H-TS | Shiga, Yamaoka, et al., 1972 | gas phase; From CH2=CHNO2 |
ΔrG° | <1531.3 | kJ/mol | IMRB | Bartmess, 1980 | gas phase |
(CAS Reg. No. 25590-58-3 • 4294967295) +
= CAS Reg. No. 25590-58-3
By formula: (CAS Reg. No. 25590-58-3 • 4294967295C2H3NO2) + C2H3NO2 = CAS Reg. No. 25590-58-3
Quantity | Value | Units | Method | Reference | Comment |
---|---|---|---|---|---|
ΔrH° | 326. ± 13. | kJ/mol | N/A | Bartmess, Scott, et al., 1979 | gas phase; value altered from reference due to change in acidity scale |

Gas phase ion energetics data

Data compiled as indicated in comments:
B - John E. Bartmess
LL - Sharon G. Lias and Joel F. Liebman
Electron affinity determinations
EA (eV) | Method | Reference | Comment |
---|---|---|---|
>1.64784 | IMRB | Bartmess, 1980 | Computations indicate HOF(A-) ca. -10, EA ca. 19 kcal/mol; B |
Ionization energy determinations
IE (eV) | Method | Reference | Comment |
---|---|---|---|
11.0 | EST | Takhistov and Ponomarev, 1994 | LL |
10.85 | PE | Pasa-Tolic, Klasine, et al., 1990 | LL |
De-protonation reactions
C2H2NO2- + =
By formula: C2H2NO2- + H+ = C2H3NO2
Quantity | Value | Units | Method | Reference | Comment |
---|---|---|---|---|---|
ΔrH° | 1515. ± 19. | kJ/mol | EIAE | Shiga, Yamaoka, et al., 1972 | gas phase; From CH2=CHNO2; B |
ΔrH° | <1563.1 | kJ/mol | G+TS | Bartmess, 1980 | gas phase; B |
Quantity | Value | Units | Method | Reference | Comment |
ΔrG° | 1483. ± 22. | kJ/mol | H-TS | Shiga, Yamaoka, et al., 1972 | gas phase; From CH2=CHNO2; B |
ΔrG° | <1531.3 | kJ/mol | IMRB | Bartmess, 1980 | gas phase; B |

References

Weast and Grasselli, 1989
CRC Handbook of Data on Organic Compounds, 2nd Editon, Weast,R.C and Grasselli, J.G., ed(s)., CRC Press, Inc., Boca Raton, FL, 1989, 1. [all data]
Shiga, Yamaoka, et al., 1972
Shiga, T.; Yamaoka, H.; Arakawa, K.; Suguira, T.,
A negative ion-molecule reaction in nitroethylene,
Bull. Chem. Soc. Jpn., 1972, 45, 2065. [all data]
Bartmess, 1980
Bartmess, J.E.,
Solvent effects on ion-molecule reactions. Vinyl anions vs. conjugate addition,
J. Am. Chem. Soc., 1980, 102, 2483. [all data]
Bartmess, Scott, et al., 1979
Bartmess, J.E.; Scott, J.A.; McIver, R.T., Jr.,
The gas phase acidity scale from methanol to phenol,
J. Am. Chem. Soc., 1979, 101, 6047. [all data]
Takhistov and Ponomarev, 1994
Takhistov, V.V.; Ponomarev, D.A.,
Isodesmic reactions and thermochemistry of ions,
Org. Mass Spectrom., 1994, 29, 395. [all data]
Pasa-Tolic, Klasine, et al., 1990
Pasa-Tolic, L.; Klasine, L.; McGlynn, S.P.,
The HeI PE spectrum and electronic structure of nitroethene,
Chem. Phys. Lett., 1990, 170, 113. [all data]