Benzene, pentafluoro-
- Formula: C6HF5
- Molecular weight: 168.0642
- IUPAC Standard InChIKey: WACNXHCZHTVBJM-UHFFFAOYSA-N
- CAS Registry Number: 363-72-4
- Chemical structure:
View 3d structure (requires JavaScript / HTML 5) - Other names: Pentafluorobenzene; 1,2,3,4,5-Pentafluorobenzene

Gas phase thermochemistry data

Data compiled by: Hussein Y. Afeefy, Joel F. Liebman, and Stephen E. Stein
Quantity | Value | Units | Method | Reference | Comment |
---|---|---|---|---|---|
ΔfH°gas | -806.0 ± 1.4 | kJ/mol | Ccr | Cox, Gundry, et al., 1969 |

Condensed phase thermochemistry data

Data compiled as indicated in comments:
ALS - Hussein Y. Afeefy, Joel F. Liebman, and Stephen E. Stein
DH - Eugene S. Domalski and Elizabeth D. Hearing
Quantity | Value | Units | Method | Reference | Comment |
---|---|---|---|---|---|
ΔfH°liquid | -842.2 ± 1.4 | kJ/mol | Ccr | Cox, Gundry, et al., 1969 | ALS |
Quantity | Value | Units | Method | Reference | Comment |
ΔcH°liquid | -2557.0 ± 1.4 | kJ/mol | Ccr | Cox, Gundry, et al., 1969 | ALS |
Quantity | Value | Units | Method | Reference | Comment |
S°liquid | 279.49 | J/mol*K | N/A | Paukov and Lavrent'eva, 1969 | DH |
S°liquid | 275.9 | J/mol*K | N/A | Counsell, Hales, et al., 1968 | DH |
Constant pressure heat capacity of liquid
Cp,liquid (J/mol*K) | Temperature (K) | Reference | Comment |
---|---|---|---|
210.79 | 298.15 | Paukov and Lavrent'eva, 1969 | T = 12 to 300 K.; DH |
204.7 | 298.15 | Counsell, Hales, et al., 1968 | T = 12 to 324 K.; DH |

Phase change data

Data compiled as indicated in comments:
BS - Robert L. Brown and Stephen E. Stein
TRC - Thermodynamics Research Center, NIST Boulder Laboratories, Chris Muzny director
AC - William E. Acree, Jr., James S. Chickos
ALS - Hussein Y. Afeefy, Joel F. Liebman, and Stephen E. Stein
DH - Eugene S. Domalski and Elizabeth D. Hearing
Quantity | Value | Units | Method | Reference | Comment |
---|---|---|---|---|---|
Tboil | 358. ± 1. | K | AVG | N/A | Average of 7 values; Individual data points |
Quantity | Value | Units | Method | Reference | Comment |
Ttriple | 225.67 | K | N/A | Paukov and Lavrent'eva, 1969, 2 | Uncertainty assigned by TRC = 0.02 K; TRC |
Ttriple | 225.83 | K | N/A | Counsell, Hales, et al., 1968, 2 | Uncertainty assigned by TRC = 0.02 K; TRC |
Quantity | Value | Units | Method | Reference | Comment |
Tc | 532. | K | N/A | Majer and Svoboda, 1985 | |
Tc | 530.8 | K | N/A | Skripov and Muratov, 1977 | TRC |
Tc | 530.96 | K | N/A | Hales and Townsend, 1974 | Uncertainty assigned by TRC = 0.05 K; TRC |
Tc | 530.97 | K | N/A | Ambrose and Sprake, 1971 | Uncertainty assigned by TRC = 0.03 K; TRC |
Tc | 531.95 | K | N/A | Evans and Tiley, 1966 | Uncertainty assigned by TRC = 0.05 K; TRC |
Quantity | Value | Units | Method | Reference | Comment |
Pc | 34.70 | bar | N/A | Skripov and Muratov, 1977 | Vis, pc by extrapolation of VP; TRC |
Pc | 35.31 | bar | N/A | Ambrose and Sprake, 1971 | Uncertainty assigned by TRC = 0.05 bar; TRC |
Pc | 35.16 | bar | N/A | Evans and Tiley, 1966 | Uncertainty assigned by TRC = 0.10 bar; TRC |
Quantity | Value | Units | Method | Reference | Comment |
ρc | 3.080 | mol/l | N/A | Hales and Townsend, 1974 | Uncertainty assigned by TRC = 0.0030 mol/l; Liquid density determined by magnetically balanced float up to 490 K, see J.L.Hales, 1970-128. Critical D by equation due to Riedel.; TRC |
Quantity | Value | Units | Method | Reference | Comment |
ΔvapH° | 36.36 | kJ/mol | N/A | Majer and Svoboda, 1985 | |
ΔvapH° | 36.2 | kJ/mol | N/A | Invernizzi, 1982 | Based on data from 290. to 510. K. See also Basarová and Svoboda, 1991.; AC |
ΔvapH° | 36.2 ± 0.2 | kJ/mol | V | Cox, Gundry, et al., 1969 | ALS |
ΔvapH° | 36.39 | kJ/mol | V | Findlay, 1969 | ALS |
Enthalpy of vaporization
ΔvapH (kJ/mol) | Temperature (K) | Method | Reference | Comment |
---|---|---|---|---|
32.15 | 358.9 | N/A | Majer and Svoboda, 1985 | |
33.5 | 373. | A | Stephenson and Malanowski, 1987 | Based on data from 358. to 397. K.; AC |
32.6 | 408. | A | Stephenson and Malanowski, 1987 | Based on data from 393. to 479. K.; AC |
32.2 | 488. | A | Stephenson and Malanowski, 1987 | Based on data from 473. to 531. K.; AC |
34.8 | 337. | A | Stephenson and Malanowski, 1987 | Based on data from 322. to 368. K. See also Ambrose, 1968.; AC |
34.776 ± 0.006 | 190. | C | Counsell, Hales, et al., 1968, 2 | ALS |
32.0 | 388. | EB | Evans and Tiley, 1966, 2 | Based on data from 373. to 530. K.; AC |
35.7 | 313. | N/A | Patrick and Prosser, 1964 | Based on data from 298. to 358. K. See also Boublik, Fried, et al., 1984.; AC |
Enthalpy of vaporization
ΔvapH =
A exp(-βTr) (1 − Tr)β
ΔvapH =
Enthalpy of vaporization (at saturation pressure)
(kJ/mol)
Tr = reduced temperature (T / Tc)
View plot Requires a JavaScript / HTML 5 canvas capable browser.
Temperature (K) | A (kJ/mol) | β | Tc (K) | Reference | Comment |
---|---|---|---|---|---|
321. to 359. | 54.24 | 0.2911 | 532. | Majer and Svoboda, 1985 |
Antoine Equation Parameters
log10(P) = A − (B / (T + C))
P = vapor pressure (bar)
T = temperature (K)
View plot Requires a JavaScript / HTML 5 canvas capable browser.
Temperature (K) | A | B | C | Reference | Comment |
---|---|---|---|---|---|
321.88 to 367.5 | 4.16086 | 1253.674 | -57.179 | Ambrose, 1968, 2 | Coefficents calculated by NIST from author's data. |
373.36 to 529.53 | 4.6363 | 1635.174 | -3.684 | Evans and Tiley, 1966, 3 | Coefficents calculated by NIST from author's data. |
Enthalpy of fusion
ΔfusH (kJ/mol) | Temperature (K) | Reference | Comment |
---|---|---|---|
10.883 | 225.67 | Paukov and Lavrent'eva, 1969 | DH |
10.853 | 225.83 | Counsell, Hales, et al., 1968 | DH |
10.88 | 225.7 | Acree, 1991 | AC |
Entropy of fusion
ΔfusS (J/mol*K) | Temperature (K) | Reference | Comment |
---|---|---|---|
48.22 | 225.67 | Paukov and Lavrent'eva, 1969 | DH |
48.06 | 225.83 | Counsell, Hales, et al., 1968 | DH |

Reaction thermochemistry data

Data compiled as indicated in comments:
B - John E. Bartmess
M - Michael M. Meot-Ner (Mautner) and Sharon G. Lias
RCD - Robert C. Dunbar
Individual Reactions
By formula: F- + C6HF5 = (F- • C6HF5)
Quantity | Value | Units | Method | Reference | Comment |
---|---|---|---|---|---|
ΔrH° | 122. ± 8.4 | kJ/mol | IMRE | Dillow and Kebarle, 1988 | gas phase; Anchored to C6F6..F- in Hiraoka, Mizuse, et al., 1987; B,M |
Quantity | Value | Units | Method | Reference | Comment |
ΔrS° | 84.1 | J/mol*K | N/A | Dillow and Kebarle, 1988 | gas phase; switching reaction,Thermochemical ladder(F-)C6F6, Entropy change calculated or estimated; Hiraoka, Mizuse, et al., 1987; M |
Quantity | Value | Units | Method | Reference | Comment |
ΔrG° | 86.6 ± 8.4 | kJ/mol | IMRE | Dillow and Kebarle, 1988 | gas phase; Anchored to C6F6..F- in Hiraoka, Mizuse, et al., 1987; B |
Free energy of reaction
ΔrG° (kJ/mol) | T (K) | Method | Reference | Comment |
---|---|---|---|---|
86.6 | 423. | PHPMS | Dillow and Kebarle, 1988 | gas phase; switching reaction,Thermochemical ladder(F-)C6F6, Entropy change calculated or estimated; Hiraoka, Mizuse, et al., 1987; M |
C6F5- + =
By formula: C6F5- + H+ = C6HF5
Quantity | Value | Units | Method | Reference | Comment |
---|---|---|---|---|---|
ΔrH° | 1492. ± 8.8 | kJ/mol | G+TS | Buker, Nibbering, et al., 1997 | gas phase; B |
ΔrH° | <1559.6 ± 1.3 | kJ/mol | G+TS | Herd, Adams, et al., 1989 | gas phase; More acidic than HF, less than HCl; B |
ΔrH° | 1539. ± 21. | kJ/mol | D-EA | Compton and Reinhardt, 1982 | gas phase; From perfluorobenzene; B |
Quantity | Value | Units | Method | Reference | Comment |
ΔrG° | 1460. ± 8.4 | kJ/mol | IMRE | Buker, Nibbering, et al., 1997 | gas phase; B |
ΔrG° | <1527.2 | kJ/mol | IMRB | Herd, Adams, et al., 1989 | gas phase; More acidic than HF, less than HCl; B |
ΔrG° | 1507. ± 21. | kJ/mol | H-TS | Compton and Reinhardt, 1982 | gas phase; From perfluorobenzene; B |
By formula: C6H6+ + C6HF5 = (C6H6+ • C6HF5)
Bond type: Charge transfer bond (positive ion)
Quantity | Value | Units | Method | Reference | Comment |
---|---|---|---|---|---|
ΔrH° | 46.9 | kJ/mol | PHPMS | Meot-Ner (Mautner), Hamlet, et al., 1978 | gas phase; Entropy change calculated or estimated; M |
Quantity | Value | Units | Method | Reference | Comment |
ΔrS° | 110. | J/mol*K | N/A | Meot-Ner (Mautner), Hamlet, et al., 1978 | gas phase; Entropy change calculated or estimated; M |
Free energy of reaction
ΔrG° (kJ/mol) | T (K) | Method | Reference | Comment |
---|---|---|---|---|
13. | 300. | PHPMS | Meot-Ner (Mautner), Hamlet, et al., 1978 | gas phase; Entropy change calculated or estimated; M |
By formula: Cr+ + C6HF5 = (Cr+ • C6HF5)
Quantity | Value | Units | Method | Reference | Comment |
---|---|---|---|---|---|
ΔrH° | 99.2 | kJ/mol | RAK | Ryzhov, 1999 | RCD |

Gas phase ion energetics data

Data evaluated as indicated in comments:
HL - Edward P. Hunter and Sharon G. Lias
L - Sharon G. Lias
Data compiled as indicated in comments:
B - John E. Bartmess
LLK - Sharon G. Lias, Rhoda D. Levin, and Sherif A. Kafafi
RDSH - Henry M. Rosenstock, Keith Draxl, Bruce W. Steiner, and John T. Herron
Quantity | Value | Units | Method | Reference | Comment |
---|---|---|---|---|---|
IE (evaluated) | 9.63 | eV | N/A | N/A | L |
Quantity | Value | Units | Method | Reference | Comment |
Proton affinity (review) | 690.4 | kJ/mol | N/A | Hunter and Lias, 1998 | HL |
Quantity | Value | Units | Method | Reference | Comment |
Gas basicity | 662.7 | kJ/mol | N/A | Hunter and Lias, 1998 | HL |
Electron affinity determinations
EA (eV) | Method | Reference | Comment |
---|---|---|---|
<0.434 ± 0.087 | IMRB | Dillow and Kebarle, 1989 | Observed only at 303K and below; B |
0.730 ± 0.080 | ECD | Wentworth, Limero, et al., 1987 | B |
Ionization energy determinations
IE (eV) | Method | Reference | Comment |
---|---|---|---|
9.73 | PE | Sell, Mintz, et al., 1978 | LLK |
9.631 ± 0.004 | EQ | Lias and Ausloos, 1978 | LLK |
9.82 | S | Smith and Raymonda, 1971 | LLK |
9.84 | PI | Bralsford, Harris, et al., 1960 | RDSH |
9.90 | PE | Trudell and Price, 1979 | Vertical value; LLK |
9.64 | PE | Streets and Ceasar, 1973 | Vertical value; LLK |
Appearance energy determinations
Ion | AE (eV) | Other Products | Method | Reference | Comment |
---|---|---|---|---|---|
C6HF4+ | 16.5 ± 0.1 | F | EI | Majer and Patrick, 1962 | RDSH |
De-protonation reactions
C6F5- + =
By formula: C6F5- + H+ = C6HF5
Quantity | Value | Units | Method | Reference | Comment |
---|---|---|---|---|---|
ΔrH° | 1492. ± 8.8 | kJ/mol | G+TS | Buker, Nibbering, et al., 1997 | gas phase; B |
ΔrH° | <1559.6 ± 1.3 | kJ/mol | G+TS | Herd, Adams, et al., 1989 | gas phase; More acidic than HF, less than HCl; B |
ΔrH° | 1539. ± 21. | kJ/mol | D-EA | Compton and Reinhardt, 1982 | gas phase; From perfluorobenzene; B |
Quantity | Value | Units | Method | Reference | Comment |
ΔrG° | 1460. ± 8.4 | kJ/mol | IMRE | Buker, Nibbering, et al., 1997 | gas phase; B |
ΔrG° | <1527.2 | kJ/mol | IMRB | Herd, Adams, et al., 1989 | gas phase; More acidic than HF, less than HCl; B |
ΔrG° | 1507. ± 21. | kJ/mol | H-TS | Compton and Reinhardt, 1982 | gas phase; From perfluorobenzene; B |

Ion clustering data

Data compiled as indicated in comments:
M - Michael M. Meot-Ner (Mautner) and Sharon G. Lias
RCD - Robert C. Dunbar
B - John E. Bartmess
Clustering reactions
By formula: C6H6+ + C6HF5 = (C6H6+ • C6HF5)
Bond type: Charge transfer bond (positive ion)
Quantity | Value | Units | Method | Reference | Comment |
---|---|---|---|---|---|
ΔrH° | 46.9 | kJ/mol | PHPMS | Meot-Ner (Mautner), Hamlet, et al., 1978 | gas phase; Entropy change calculated or estimated; M |
Quantity | Value | Units | Method | Reference | Comment |
ΔrS° | 110. | J/mol*K | N/A | Meot-Ner (Mautner), Hamlet, et al., 1978 | gas phase; Entropy change calculated or estimated; M |
Free energy of reaction
ΔrG° (kJ/mol) | T (K) | Method | Reference | Comment |
---|---|---|---|---|
13. | 300. | PHPMS | Meot-Ner (Mautner), Hamlet, et al., 1978 | gas phase; Entropy change calculated or estimated; M |
By formula: Cr+ + C6HF5 = (Cr+ • C6HF5)
Quantity | Value | Units | Method | Reference | Comment |
---|---|---|---|---|---|
ΔrH° | 99.2 | kJ/mol | RAK | Ryzhov, 1999 | RCD |
By formula: F- + C6HF5 = (F- • C6HF5)
Quantity | Value | Units | Method | Reference | Comment |
---|---|---|---|---|---|
ΔrH° | 122. ± 8.4 | kJ/mol | IMRE | Dillow and Kebarle, 1988 | gas phase; Anchored to C6F6..F- in Hiraoka, Mizuse, et al., 1987; B,M |
Quantity | Value | Units | Method | Reference | Comment |
ΔrS° | 84.1 | J/mol*K | N/A | Dillow and Kebarle, 1988 | gas phase; switching reaction,Thermochemical ladder(F-)C6F6, Entropy change calculated or estimated; Hiraoka, Mizuse, et al., 1987; M |
Quantity | Value | Units | Method | Reference | Comment |
ΔrG° | 86.6 ± 8.4 | kJ/mol | IMRE | Dillow and Kebarle, 1988 | gas phase; Anchored to C6F6..F- in Hiraoka, Mizuse, et al., 1987; B |
Free energy of reaction
ΔrG° (kJ/mol) | T (K) | Method | Reference | Comment |
---|---|---|---|---|
86.6 | 423. | PHPMS | Dillow and Kebarle, 1988 | gas phase; switching reaction,Thermochemical ladder(F-)C6F6, Entropy change calculated or estimated; Hiraoka, Mizuse, et al., 1987; M |

Kovats' RI, non-polar column, isothermal

Column type | Active phase | Temperature (C) | I | Reference | Comment |
---|---|---|---|---|---|
Packed | Squalane | 100. | 589. | Vernon and Edwards, 1975 | N2, DCMS-treated Celite; Column length: 1. m |
Packed | Apiezon L | 100. | 594. | Brown, Chapman, et al., 1968 | N2, DCMS-treated Chromosorb W; Column length: 2.3 m |

References

Cox, Gundry, et al., 1969
Cox, J.D.; Gundry, H.A.; Harrop, D.; Head, A.J.,
Thermodynamic properties of fluorine compounds. 9. Enthalpies of formation of some compounds containing the pentafluorophenyl group,
J. Chem. Thermodyn., 1969, 1, 77-87. [all data]
Paukov and Lavrent'eva, 1969
Paukov, I.E.; Lavrent'eva, M.N.,
Thermodynamic properties of pentafluorobenzene over the range 12-300K,
Zhur. Fiz. Khim., 1969, 43, 2938-2941. [all data]
Counsell, Hales, et al., 1968
Counsell, J.F.; Hales, J.L.; Martin, J.F.,
Thermodynamic properties of fluorine compounds. Part VI. The heat capacity and entropy of pentafluorobenzene,
J. Chem. Soc. A, 1968, 2042-2044. [all data]
Paukov and Lavrent'eva, 1969, 2
Paukov, I.E.; Lavrent'eva, M.N.,
Thermodynamic properties of pentafluorobenzene over the range 12-300 K,
Zh. Fiz. Khim., 1969, 43, 2938. [all data]
Counsell, Hales, et al., 1968, 2
Counsell, J.F.; Hales, J.L.; Martin, J.F.,
Thermodynamic properties of flourine compounds. Part VI. The heat capacity and entropy of pentafluorobenzene,
J. Chem. Soc. A, 1968, 2042. [all data]
Majer and Svoboda, 1985
Majer, V.; Svoboda, V.,
Enthalpies of Vaporization of Organic Compounds: A Critical Review and Data Compilation, Blackwell Scientific Publications, Oxford, 1985, 300. [all data]
Skripov and Muratov, 1977
Skripov, V.P.; Muratov, G.N.,
The surface tensions of liquids and their interpretation by the method of thermodynamic similarity.,
Russ. J. Phys. Chem. (Engl. Transl.), 1977, 51, 806-8. [all data]
Hales and Townsend, 1974
Hales, J.L.; Townsend, R.,
Liquid Densities from 293 to 490 K of Eight Fluorinated Aromatic Comp.,
J. Chem. Thermodyn., 1974, 6, 111-6. [all data]
Ambrose and Sprake, 1971
Ambrose, D.; Sprake, C.H.S.,
Thermodynamic properties of fluorine compounds: x critical properties and vapour pressures of pentafluorobenzene, chloropentafluorobenzene, 2,3,4,5,6 -pentafluorotoluene, and pentafluorophenol,
J. Chem. Soc. A, 1971, 1971, 1263. [all data]
Evans and Tiley, 1966
Evans, F.D.; Tiley, P.F.,
Vapour Pressures and Critical Constants of Hexafluoro, Pentafluoro-, Chloropentafrluoro-, and Bromopentafluoro-benzene,
J. Chem. Soc. B, 1966, 1966, 134-6. [all data]
Invernizzi, 1982
Invernizzi, C.,
Termotecnica, 1982, 4, 78. [all data]
Basarová and Svoboda, 1991
Basarová, Pavlína; Svoboda, Václav,
Calculation of heats of vaporization of halogenated hydrocarbons from saturated vapour pressure data,
Fluid Phase Equilibria, 1991, 68, 13-34, https://doi.org/10.1016/0378-3812(91)85008-I
. [all data]
Findlay, 1969
Findlay, T.J.V.,
Vapor pressures of fluorobenzenes from 5° to 50°C,
J. Chem. Eng. Data, 1969, 14, 229. [all data]
Stephenson and Malanowski, 1987
Stephenson, Richard M.; Malanowski, Stanislaw,
Handbook of the Thermodynamics of Organic Compounds, 1987, https://doi.org/10.1007/978-94-009-3173-2
. [all data]
Ambrose, 1968
Ambrose, D.,
Thermodynamic properties of fluorine compounds. Part V. Vapour pressures of pentafluorobenzene, chloropentafluorobenzene, 2,3,4,5,6-pentafluorotoluene, and pentafluorophenol,
J. Chem. Soc., A, 1968, 1381, https://doi.org/10.1039/j19680001381
. [all data]
Evans and Tiley, 1966, 2
Evans, F.D.; Tiley, P.F.,
Vapour pressures and critical constants of hexafluoro-, pentafluoro-, chloropentafluoro-, and bromopentafluoro-benzene,
J. Chem. Soc., B:, 1966, 134, https://doi.org/10.1039/j29660000134
. [all data]
Patrick and Prosser, 1964
Patrick, C.R.; Prosser, G.S.,
Vapour pressures and related properties of hexafluorobenzene and of pentafluorobenzene,
Trans. Faraday Soc., 1964, 60, 700, https://doi.org/10.1039/tf9646000700
. [all data]
Boublik, Fried, et al., 1984
Boublik, T.; Fried, V.; Hala, E.,
The Vapour Pressures of Pure Substances: Selected Values of the Temperature Dependence of the Vapour Pressures of Some Pure Substances in the Normal and Low Pressure Region, 2nd ed., Elsevier, New York, 1984, 972. [all data]
Ambrose, 1968, 2
Ambrose, D.,
Thermodynamic Properties of Fluorine Compounds. Part V. Vapour Pressures of Pentafluorobenzene, Chloropentafluorobenzene, 2,3,4,5,6-Pentafluorotoluene, and Pentafluorophenol,
J. Chem. Soc. A:, 1968, 1381-1383, https://doi.org/10.1039/j19680001381
. [all data]
Evans and Tiley, 1966, 3
Evans, F.D.; Tiley,
Vapour Pressures and Critical Constants of Hexafluoro-, Pentafluoro-, Chloropentafluoro-, and Bromopentafluoro-benzene,
J. Chem. Soc. B:, 1966, 134-136, https://doi.org/10.1039/j29660000134
. [all data]
Acree, 1991
Acree, William E.,
Thermodynamic properties of organic compounds: enthalpy of fusion and melting point temperature compilation,
Thermochimica Acta, 1991, 189, 1, 37-56, https://doi.org/10.1016/0040-6031(91)87098-H
. [all data]
Dillow and Kebarle, 1988
Dillow, G.W.; Kebarle, P.,
Fluoride Affinities of Perfluorobenzenes C6F5X. Meisenheimer Complexes in the Gas Phase and Solution,
J. Am. Chem. Soc., 1988, 110, 15, 4877, https://doi.org/10.1021/ja00223a001
. [all data]
Hiraoka, Mizuse, et al., 1987
Hiraoka, K.; Mizuse, S.; Yamabe, S.,
A Determination of the Stability and Structure of F-(C6H6) and F-(C6F6) Clusters,
J. Chem. Phys., 1987, 86, 7, 4102, https://doi.org/10.1063/1.451920
. [all data]
Buker, Nibbering, et al., 1997
Buker, H.H.; Nibbering, N.M.M.; Espinosa, D.; Mongin, F.; Schlosser, M.,
Additivity of substituent effects in the fluoroarene series: Equilibrium acidity in the gas phase and deprotonation rates in ethereal solution,
Tetrahed. Lett., 1997, 38, 49, 8519-8522, https://doi.org/10.1016/S0040-4039(97)10303-3
. [all data]
Herd, Adams, et al., 1989
Herd, C.R.; Adams, N.G.; Smith, D.,
FALP Studies of Electron Attachment Reactions of C6F5Cl, C6F5Br, and C6F5I,
Int. J. Mass Spectrom. Ion Proc., 1989, 87, 3, 331, https://doi.org/10.1016/0168-1176(89)80032-1
. [all data]
Compton and Reinhardt, 1982
Compton, R.N.; Reinhardt, P.W.,
Collisonal ionization between fast alkali atoms and hexafluorobenzene,
Chem. Phys. Lett., 1982, 91, 268. [all data]
Meot-Ner (Mautner), Hamlet, et al., 1978
Meot-Ner (Mautner), M.; Hamlet, P.; Hunter, E.P.; Field, F.H.,
Bonding Energies in Association Ions of Aromatic Molecules. Correlations with Ionization Energies,
J. Am. Chem. Soc., 1978, 100, 17, 5466, https://doi.org/10.1021/ja00485a034
. [all data]
Ryzhov, 1999
Ryzhov, V.,
Binding Energies of Chromium Cations with Fluorobenzenes from Radiative Association Kinetics,
Int. J. Mass Spectrom., 1999, 185/186/187, 913. [all data]
Hunter and Lias, 1998
Hunter, E.P.; Lias, S.G.,
Evaluated Gas Phase Basicities and Proton Affinities of Molecules: An Update,
J. Phys. Chem. Ref. Data, 1998, 27, 3, 413-656, https://doi.org/10.1063/1.556018
. [all data]
Dillow and Kebarle, 1989
Dillow, G.W.; Kebarle, P.,
Substituent Effects on the Electron Affinities of Perfluorobenzenes C6F5X,
J. Am. Chem. Soc., 1989, 111, 15, 5592, https://doi.org/10.1021/ja00197a014
. [all data]
Wentworth, Limero, et al., 1987
Wentworth, W.E.; Limero, T.; Chen, E.C.M.,
Electron Affinities of Hexafluorobenzene and Pentafluorobenzene,
J. Phys. Chem., 1987, 91, 1, 241, https://doi.org/10.1021/j100285a051
. [all data]
Sell, Mintz, et al., 1978
Sell, J.A.; Mintz, D.M.; Kupperman, A.,
Photoelectron angular distributions of carbon-carbon π electrons in ethylene, benzene, and their fluorinated derivatives,
Chem. Phys. Lett., 1978, 58, 601. [all data]
Lias and Ausloos, 1978
Lias, S.G.; Ausloos, P.J.,
eIonization energies of organic compounds by equilibrium measurements,
J. Am. Chem. Soc., 1978, 100, 6027. [all data]
Smith and Raymonda, 1971
Smith, D.R.; Raymonda, J.W.,
Rydberg states in fluorinated benzenes; hexa-, penta-, and mono- fluorobenzene,
Chem. Phys. Lett., 1971, 12, 269. [all data]
Bralsford, Harris, et al., 1960
Bralsford, R.; Harris, P.V.; Price, W.C.,
The effect of fluorine on the electronic spectra and ionization potentials of molecules,
Proc. Roy. Soc. (London), 1960, A258, 459. [all data]
Trudell and Price, 1979
Trudell, B.C.; Price, S.J.W.,
The ultraviolet photoelectron spectra of C6F5X compounds, X=(F, Cl, Br, I, H, CH3),
Can. J. Chem., 1979, 57, 2256. [all data]
Streets and Ceasar, 1973
Streets, D.G.; Ceasar, G.P.,
Inductive mesomeric effects on the π orbitals of halobenzenes,
Mol. Phys., 1973, 26, 1037. [all data]
Majer and Patrick, 1962
Majer, J.R.; Patrick, C.R.,
Electron impact on some halogenated aromatic compounds,
J. Chem. Soc. Faraday Trans., 1962, 58, 17. [all data]
Vorozhtsov, Barhash, et al., 1964
Vorozhtsov, N.N.; Barhash, V.a.; Ivanova, N.G.; Anichkina, S.A.; Andrievskaya, O.I.,
Synthesis and reactions of pentaflluorophenyl- and heptafluoronaphthyl magnesiumchlorides,
Dokl. Akad. Nauk SSSR, 1964, 159, 1, 125-128. [all data]
Vernon and Edwards, 1975
Vernon, F.; Edwards, G.T.,
Gas-liquid chromatography on fluorinated stationary phases. I. Hydrocarbons and fluorocarbons,
J. Chromatogr., 1975, 110, 1, 73-80, https://doi.org/10.1016/S0021-9673(00)91212-3
. [all data]
Brown, Chapman, et al., 1968
Brown, I.; Chapman, I.L.; Nicholson, G.J.,
Gas chromatography of polar solutes in electron acceptor stationary phases,
Aust. J. Chem., 1968, 21, 5, 1125-1141, https://doi.org/10.1071/CH9681125
. [all data]