Tricyclo[3.2.1.02,4]oct-6-ene,(1α,2β,4β,5α)-
- Formula: C8H10
- Molecular weight: 106.1650
- IUPAC Standard InChIKey: ZYVIMZRTFMWLDQ-XUTVFYLZSA-N
- CAS Registry Number: 3635-95-8
- Chemical structure:
View 3d structure (requires JavaScript / HTML 5) - Species with the same structure:

Gas phase thermochemistry data

Data compiled by: Hussein Y. Afeefy, Joel F. Liebman, and Stephen E. Stein
Quantity | Value | Units | Method | Reference | Comment |
---|---|---|---|---|---|
ΔfH°gas | 231. ± 0.4 | kJ/mol | Chyd | Roth, Adamczak, et al., 1991 | |
ΔfH°gas | 213. ± 4.2 | kJ/mol | Ccb | Hassenruck, Martin, et al., 1987 |

Condensed phase thermochemistry data

Data compiled by: Hussein Y. Afeefy, Joel F. Liebman, and Stephen E. Stein
Quantity | Value | Units | Method | Reference | Comment |
---|---|---|---|---|---|
ΔfH°liquid | 170.6 ± 1.4 | kJ/mol | Ccb | Hassenruck, Martin, et al., 1987 |

Phase change data

Data compiled by: Donald R. Burgess, Jr.
Quantity | Value | Units | Method | Reference | Comment |
---|---|---|---|---|---|
ΔvapH° | 42.4 | kJ/mol | N/A | Hassenruck, Martin, et al., 1987 |

Reaction thermochemistry data

Data compiled by: Hussein Y. Afeefy, Joel F. Liebman, and Stephen E. Stein
Individual Reactions
By formula: 2H2 + C8H10 = C8H14
Quantity | Value | Units | Method | Reference | Comment |
---|---|---|---|---|---|
ΔrH° | -313. ± 0.4 | kJ/mol | Chyd | Roth, Adamczak, et al., 1991 | liquid phase |

Gas phase ion energetics data

Data compiled by: Sharon G. Lias, Rhoda D. Levin, and Sherif A. Kafafi
Ionization energy determinations
IE (eV) | Method | Reference | Comment |
---|---|---|---|
8.90 | PE | Bischof, Heilbronner, et al., 1971 | Vertical value |

References

Roth, Adamczak, et al., 1991
Roth, W.R.; Adamczak, O.; Breuckmann, R.; Lennartz, H.-W.; Boese, R.,
Die Berechnung von Resonanzenergien; das MM2ERW-Kraftfeld,
Chem. Ber., 1991, 124, 2499-2521. [all data]
Hassenruck, Martin, et al., 1987
Hassenruck, K.; Martin, H.-D.; Mayer, B.; Urbanek, T.; Zirwes, T.; Walsh, R.; Beckhaus, H.-D.,
An Experimental Approach to the C8H10 Hypersurface. Kinetic and Thermochemical Investigations on a Formally Forbidden Ground-state [2σ + 2π] Cycloaddition,
Chem. Ber., 1987, 120, 177-186. [all data]
Bischof, Heilbronner, et al., 1971
Bischof, P.; Heilbronner, E.; Prinzbach, H.; Martin, H.D.,
A photoelectron-spectroscopic investigation of the homoconjugative interaction between π- and Walsh-orbitals in endo- and exo- cyclopropano-norbornene,
Helv. Chim. Acta, 1971, 54, 1072. [all data]