Dispiro[2.2.2.2]deca-4,9-diene
- Formula: C10H12
- Molecular weight: 132.2023
- IUPAC Standard InChIKey: KJMIPVPSDCDIJC-UHFFFAOYSA-N
- CAS Registry Number: 36262-33-6
- Chemical structure:
View 3d structure (requires JavaScript / HTML 5) - Other names: Dispiro[2.2.2.2]deca-4,5-diene

Gas phase thermochemistry data

Data compiled by: Hussein Y. Afeefy, Joel F. Liebman, and Stephen E. Stein
Quantity | Value | Units | Method | Reference | Comment |
---|---|---|---|---|---|
ΔfH°gas | 303. | kJ/mol | Chyd | Roth and Unger, 1995 |

Gas phase ion energetics data

Data compiled as indicated in comments:
LLK - Sharon G. Lias, Rhoda D. Levin, and Sherif A. Kafafi
Ionization energy determinations
IE (eV) | Method | Reference | Comment |
---|---|---|---|
7.33 ± 0.05 | PI | Nakato, Chiyoda, et al., 1974 | LLK |
7.23 | PE | Harada, Ohno, et al., 1974 | LLK |
7.82 | PE | Asmus, Klessinger, et al., 1975 | Vertical value; LLK |

References

Roth and Unger, 1995
Roth, W.R.; Unger, C.,
Zum konzertierten oder nichtk0onzertierten verlaur von reaktionen; thermolyse von dispiro[2.2.2]deca-4,9-dien,
Liebigs Ann., 1995, 1361-1366. [all data]
Nakato, Chiyoda, et al., 1974
Nakato, Y.; Chiyoda, T.; Tsubomura, H.,
Experimental determination of ionization potentials of organic amines, β-carotene and chlorophyll a,
Bull. Chem. Soc. Jpn., 1974, 47, 3001. [all data]
Harada, Ohno, et al., 1974
Harada, Y.; Ohno, K.; Seki, K.; Inokuchi, H.,
Photoelectron spectrum of dispiro[2.2.2.2]deca-4,9-diene. Conjugation of Walsh orbitals of cyclopropane rings with orbitals of diene,
Chem. Lett., 1974, 1081. [all data]
Asmus, Klessinger, et al., 1975
Asmus, P.; Klessinger, M.; Meyer, L.-U.; deMeijere, A.,
Conjugative interaction between cyclopropyl walsh orbitals and π-orbitals in dispiro[2.2.2.2]deca-4,9-diene,
Tetrahedron Lett., 1975, 6, 381. [all data]