Bicyclo[2.2.1]hept-2-ene,7-methoxy-syn-
- Formula: C8H12O
- Molecular weight: 124.1803
- IUPAC Standard InChIKey: RELKQDGGKGDNGY-UHFFFAOYSA-N
- CAS Registry Number: 36197-25-8
- Chemical structure:
View 3d structure (requires JavaScript / HTML 5) - Species with the same structure:

Gas phase ion energetics data

Data compiled by: Sharon G. Lias, Rhoda D. Levin, and Sherif A. Kafafi
Ionization energy determinations
IE (eV) | Method | Reference | Comment |
---|---|---|---|
8.95 | PE | Brown, 1976 | Vertical value |
8.84 ± 0.03 | PE | Neijzen, Schmitz, et al., 1975 | Vertical value |

References

Brown, 1976
Brown, R.S.,
Application of photoelectron spectroscopy to intramolecularly hydrogen-bonded systems. Part IV. π-systems; the photoelectron spectra of syn- and anti-7-norbornenol,
Can. J. Chem., 1976, 54, 3206. [all data]
Neijzen, Schmitz, et al., 1975
Neijzen, B.J.M.; Schmitz, R.F.; Klumpp, G.W.; DeLange, C.A.,
n- π Interactions in homoallylic methyl ethers. A photoelectron spectroscopic study,
Tetrahedron, 1975, 31, 873. [all data]