7H-Benz[de]anthracene-7-one, 3-iodo-
- Formula: C17H9IO
- Molecular weight: 356.1572
- IUPAC Standard InChIKey: XDYOJKMJYJWYTA-UHFFFAOYSA-N
- CAS Registry Number: 36189-45-4
- Chemical structure:
View 3d structure (requires JavaScript / HTML 5) - Permanent link for this species. Use this link for bookmarking this species for future reference.

Gas phase ion energetics data

Data compiled by: Sharon G. Lias and Joel F. Liebman
Ionization energy determinations
IE (eV) | Method | Reference |
---|---|---|
8.5 | EI | Abliz, Ueda, et al., 1990 |
Appearance energy determinations
Ion | AE (eV) | Other Products | Method | Reference | Comment |
---|---|---|---|---|---|
C16H8+ | 19.5 | CO+HI | EI | Abliz, Ueda, et al., 1990 | |
C16H9+ | 15.5 | CO+I | EI | Abliz, Ueda, et al., 1990 | |
C16H9I+ | 16.0 | CO | EI | Abliz, Ueda, et al., 1990 | |
C17H9O+ | 13.5 | I | EI | Abliz, Ueda, et al., 1990 |

References

Abliz, Ueda, et al., 1990
Abliz, Z.; Ueda, T.; Kubogata, K.; Iwashima, S.; Takekawa, M.; Aoki, J.; Kan, T.,
Mechanism of ionization and initial fragmentation in electron impact mass spectra of 3-halogenobenzanthrones,
Org. Mass Spectrom., 1990, 25, 345. [all data]