Methylenecyclooctane
- Formula: C9H16
- Molecular weight: 124.2233
- IUPAC Standard InChIKey: GQRWNDZUODCEAJ-UHFFFAOYSA-N
- CAS Registry Number: 3618-18-6
- Chemical structure:
View 3d structure (requires JavaScript / HTML 5) - Other names: Cyclooctane, methylene-

Phase change data

Data compiled by: Thermodynamics Research Center, NIST Boulder Laboratories, Chris Muzny director
Quantity | Value | Units | Method | Reference | Comment |
---|---|---|---|---|---|
Tboil | 428. | K | N/A | Sorm and Beranek, 1953 | Uncertainty assigned by TRC = 1. K |

Gas phase ion energetics data

Data compiled by: Sharon G. Lias, John E. Bartmess, Joel F. Liebman, John L. Holmes, Rhoda D. Levin, and W. Gary Mallard
Ionization energy determinations
IE (eV) | Method | Reference | Comment |
---|---|---|---|
8.79 | PE | Spanka and Rademacher, 1986 | Vertical value |

References

Sorm and Beranek, 1953
Sorm, F.; Beranek, J.,
Synthesis of methylenecycloalkanes,
Chem. Listy, 1953, 47, 708. [all data]
Spanka and Rademacher, 1986
Spanka, G.; Rademacher, P.,
Transannular interactions in difunctional medium rings. 1. n/π Interactions in cyclic amino ketones and aminoalkenes studied by photoelectron spectroscopy,
J. Org. Chem., 1986, 51, 592. [all data]