Cyclodecene
- Formula: C10H18
- Molecular weight: 138.2499
- IUPAC Standard InChIKey: UCIYGNATMHQYCT-OWOJBTEDSA-N
- CAS Registry Number: 3618-12-0
- Chemical structure:
View 3d structure (requires JavaScript / HTML 5) - Species with the same structure:
- Stereoisomers:

Gas phase ion energetics data

Data compiled by: Sharon G. Lias, Rhoda D. Levin, and Sherif A. Kafafi
Ionization energy determinations
IE (eV) | Method | Reference | Comment |
---|---|---|---|
8.98 | PE | Clary, Lewis, et al., 1974 | Vertical value |

References

Clary, Lewis, et al., 1974
Clary, D.C.; Lewis, A.A.; Morland, D.; Murrell, J.N.; Heilbronner, E.,
Ionization potentials of cycloalkenes,
J. Chem. Soc. Faraday Trans. 2, 1974, 70, 1889. [all data]