Hexamethyl tungsten
- Formula: C6H18W
- Molecular weight: 274.05
- IUPAC Standard InChIKey: XWAZCLPCQDERBK-UHFFFAOYSA-N
- CAS Registry Number: 36133-73-0
- Chemical structure:
View 3d structure (requires JavaScript / HTML 5) - Permanent link for this species. Use this link for bookmarking this species for future reference.

Gas phase thermochemistry data

Data compiled by: José A. Martinho Simões
Quantity | Value | Units | Method | Reference | Comment |
---|---|---|---|---|---|
ΔfH°gas | 775. ± 36. | kJ/mol | Review | Martinho Simões |

Condensed phase thermochemistry data

Data compiled by: José A. Martinho Simões
Quantity | Value | Units | Method | Reference | Comment |
---|---|---|---|---|---|
ΔfH°liquid | 742. ± 34. | kJ/mol | Review | Martinho Simões |

Phase change data

Data compiled by: José A. Martinho Simões
Quantity | Value | Units | Method | Reference | Comment |
---|---|---|---|---|---|
ΔvapH° | 33. ± 10. | kJ/mol | RSC | Adedeji, Connor J.A., et al., 1976 |

Gas phase ion energetics data

Data compiled as indicated in comments:
LLK - Sharon G. Lias, Rhoda D. Levin, and Sherif A. Kafafi
Ionization energy determinations
IE (eV) | Method | Reference | Comment |
---|---|---|---|
8.3 | PE | Galyer, Wilkinson, et al., 1975 | LLK |
8.59 ± 0.02 | PE | Green, Lloyd, et al., 1978 | Vertical value; LLK |
8.8 | PE | Galyer, Wilkinson, et al., 1975 | Vertical value; LLK |

References

Martinho Simões
Martinho Simões, J.A.,
Private communication (see http://webbook.nist.gov/chemistry/om/). [all data]
Adedeji, Connor J.A., et al., 1976
Adedeji, F.A.; Connor J.A.; Skinner, H.A.; Galyer, L.; Wilkinson, G.,
J. Chem. Soc., Chem. Commun., 1976, 159.. [all data]
Galyer, Wilkinson, et al., 1975
Galyer, L.; Wilkinson, G.; Lloyd, D.R.,
The photoelectron spectra of hexamethyltungsten and pentamethyltantalum,
J. Chem. Soc., Chem. Commun., 1975, 497. [all data]
Green, Lloyd, et al., 1978
Green, J.C.; Lloyd, D.R.; Galyer, L.; Mertis, K.; Wilkinson, G.,
Photoelectron spectra of some transition metal alkyls and oxoalkyls,
J. Chem. Soc. Dalton Trans., 1978, 10, 1403. [all data]