Octafluoro-2-butene
- Formula: C4F8
- Molecular weight: 200.0300
- IUPAC Standard InChIKey: WSJULBMCKQTTIG-UHFFFAOYSA-N
- CAS Registry Number: 360-89-4
- Chemical structure:
View 3d structure (requires JavaScript / HTML 5) - Stereoisomers:
- Other names: 2-Butene, 1,1,1,2,3,4,4,4-octafluoro-; Perfluoro-2-butene; Perfluorobutene-2; FC-1318; NA 2422; Octafluorobutene-2; Octafluorobut-2-ene; Perfluorobut-2-ene; UN 2422; 2-Butene, octafluoro-; Perfluoro-1-methylpropene; R 1318my; 1,1,1,2,3,4,4,4-octafluorobut-2-ene

Gas phase thermochemistry data

Quantity | Value | Units | Method | Reference | Comment |
---|---|---|---|---|---|
ΔfH°gas | -1631. | kJ/mol | Semi | Stewart, 2004 |

Phase change data

Data compiled by: Robert L. Brown and Stephen E. Stein
Quantity | Value | Units | Method | Reference | Comment |
---|---|---|---|---|---|
Tboil | 274.3 | K | N/A | PCR Inc., 1990 |

Gas phase ion energetics data

Data compiled by: Henry M. Rosenstock, Keith Draxl, Bruce W. Steiner, and John T. Herron
Ionization energy determinations
IE (eV) | Method | Reference |
---|---|---|
11.25 | PE | Dewar and Worley, 1969 |

References

Stewart, 2004
Stewart, J.J.P.,
Comparison of the accuracy of semiempirical and some DFT methods for predicting heats of formation,
J. Mol. Model, 2004, 10, 1, 6-10, https://doi.org/10.1007/s00894-003-0157-6
. [all data]
PCR Inc., 1990
PCR Inc.,
Research Chemicals Catalog 1990-1991, PCR Inc., Gainesville, FL, 1990, 1. [all data]
Dewar and Worley, 1969
Dewar, M.J.S.; Worley, S.D.,
Photoelectron spectra of molecules. I. Ionization potentials of some organic molecules and their interpretation,
J. Chem. Phys., 1969, 50, 654. [all data]