Manganese, tricarbonylbis(phosphorus trifluoride)(trimethylsilyl)-

Gas phase ion energetics data

Data compiled by: Sharon G. Lias, Rhoda D. Levin, and Sherif A. Kafafi

Ionization energy determinations

IE (eV) Method Reference
8.1 ± 0.1EISaalfeld, McDowell, et al., 1973

References

Saalfeld, McDowell, et al., 1973
Saalfeld, F.E.; McDowell, M.V.; DeCorpo, J.J.; Berry, A.D.; MacDiarmid, A.G., Mass spectral studies of some manganese carbonyls, Inorg. Chem., 1973, 12, 48. [all data]