Iodine isocyanate
- Formula: CINO
- Molecular weight: 168.9213
- IUPAC Standard InChIKey: NPURPEXKKDAKIH-UHFFFAOYSA-N
- CAS Registry Number: 3607-48-5
- Chemical structure:
View 3d structure (requires JavaScript / HTML 5) - Permanent link for this species. Use this link for bookmarking this species for future reference.

Gas phase ion energetics data

Data compiled by: Sharon G. Lias, Rhoda D. Levin, and Sherif A. Kafafi
Ionization energy determinations
IE (eV) | Method | Reference |
---|---|---|
9.89 ± 0.01 | PE | Frost, MacDonald, et al., 1980 |

Vibrational and/or electronic energy levels

Data compiled by: Marilyn E. Jacox

State:   X

Vib.
sym.
 No.   Approximate
 type of mode
 cm-1   Med.   Method   References

2201.1 vs gas IR DeVore, 1987
1298.1 w gas IR DeVore, 1987
667.0 w gas IR DeVore, 1987
462.3 w gas IR DeVore, 1987
583.3 w gas IR DeVore, 1987

Additional references: Jacox, 1994, page 198; Jemson, Lewis-Bevan, et al., 1986

References

Frost, MacDonald, et al., 1980
Frost, D.C.; MacDonald, C.B.; McDowell, C.A.; Westwood, N.P.C.,
The HeI photoelectron spectra of the halogen azides, XN3(X=Cl and Br) and the halogen isocyanates, XNCO(X=Cl, Br and I),
Chem. Phys., 1980, 47, 111. [all data]