Phosphane,[bis(trimethylsilyl)methylene]trimethyl-
- Formula: C10H27PSi2
- Molecular weight: 234.4661
- IUPAC Standard InChIKey: HHMXVDMLTFHBSZ-UHFFFAOYSA-N
- CAS Registry Number: 3607-03-2
- Chemical structure:
View 3d structure (requires JavaScript / HTML 5) - Permanent link for this species. Use this link for bookmarking this species for future reference.

Gas phase ion energetics data

Data compiled by: Sharon G. Lias, Rhoda D. Levin, and Sherif A. Kafafi
Ionization energy determinations
IE (eV) | Method | Reference | Comment |
---|---|---|---|
6.92 | PE | Starzewski, Richter, et al., 1976 | Vertical value |
6.92 | PE | Starzewski, Dieck, et al., 1974 | Vertical value |

References

Starzewski, Richter, et al., 1976
Starzewski, K.-H.A.O.; Richter, W.; Schmidbaur, H.,
Photoelektronenspektren und Struktur von Arsenyliden. P versus As: Ein Beitrag zur Problematik der ylidischen Bindung,
Chem. Ber., 1976, 109, 473. [all data]
Starzewski, Dieck, et al., 1974
Starzewski, K.A.O.; Dieck, H.T.; Bock, H.,
Photoelectron spectra molecular properties. XXIII. Photoelectron spectra of silicon-substituted ylidic systems,
J. Organomet. Chem., 1974, 65, 311. [all data]