1,1,3,3-tetrafluoroacetone
- Formula: C3H2F4O
- Molecular weight: 130.0410
- IUPAC Standard InChIKey: QAPXLUZMMFIIBI-UHFFFAOYSA-N
- CAS Registry Number: 360-52-1
- Chemical structure:
View 3d structure (requires JavaScript / HTML 5) - Species with the same structure:
- Other names: 2-Propanone, 1,1,3,3-tetrafluoro-

Reaction thermochemistry data

Data compiled as indicated in comments:
B - John E. Bartmess
M - Michael M. Meot-Ner (Mautner) and Sharon G. Lias
Individual Reactions
C3HF4O- + =
By formula: C3HF4O- + H+ = C3H2F4O
Quantity | Value | Units | Method | Reference | Comment |
---|---|---|---|---|---|
ΔrH° | 1429. ± 23. | kJ/mol | G+TS | Farid and McMahon, 1980 | gas phase; Between HCO2H, FCH2CO2H; value altered from reference due to change in acidity scale; B |
Quantity | Value | Units | Method | Reference | Comment |
ΔrG° | 1401. ± 23. | kJ/mol | IMRB | Farid and McMahon, 1980 | gas phase; Between HCO2H, FCH2CO2H; value altered from reference due to change in acidity scale; B |
By formula: Cl- + C3H2F4O = (Cl- • C3H2F4O)
Quantity | Value | Units | Method | Reference | Comment |
---|---|---|---|---|---|
ΔrG° | 75.7 ± 8.4 | kJ/mol | IMRE | Larson and McMahon, 1984 | gas phase; B,M |

Gas phase ion energetics data

Data evaluated as indicated in comments:
HL - Edward P. Hunter and Sharon G. Lias
Data compiled as indicated in comments:
B - John E. Bartmess
LLK - Sharon G. Lias, Rhoda D. Levin, and Sherif A. Kafafi
Quantity | Value | Units | Method | Reference | Comment |
---|---|---|---|---|---|
Proton affinity (review) | 698.8 | kJ/mol | N/A | Hunter and Lias, 1998 | HL |
Quantity | Value | Units | Method | Reference | Comment |
Gas basicity | 669.0 | kJ/mol | N/A | Hunter and Lias, 1998 | HL |
Ionization energy determinations
IE (eV) | Method | Reference | Comment |
---|---|---|---|
10.7 | PE | Young and Cheng, 1976 | LLK |
11.33 ± 0.02 | PE | Young and Cheng, 1976 | Vertical value; LLK |
De-protonation reactions
C3HF4O- + =
By formula: C3HF4O- + H+ = C3H2F4O
Quantity | Value | Units | Method | Reference | Comment |
---|---|---|---|---|---|
ΔrH° | 1429. ± 23. | kJ/mol | G+TS | Farid and McMahon, 1980 | gas phase; Between HCO2H, FCH2CO2H; value altered from reference due to change in acidity scale; B |
Quantity | Value | Units | Method | Reference | Comment |
ΔrG° | 1401. ± 23. | kJ/mol | IMRB | Farid and McMahon, 1980 | gas phase; Between HCO2H, FCH2CO2H; value altered from reference due to change in acidity scale; B |

Ion clustering data

Data compiled as indicated in comments:
B - John E. Bartmess
M - Michael M. Meot-Ner (Mautner) and Sharon G. Lias
Clustering reactions
By formula: Cl- + C3H2F4O = (Cl- • C3H2F4O)
Quantity | Value | Units | Method | Reference | Comment |
---|---|---|---|---|---|
ΔrG° | 75.7 ± 8.4 | kJ/mol | IMRE | Larson and McMahon, 1984 | gas phase; B,M |

References

Farid and McMahon, 1980
Farid, R.; McMahon, T.B.,
The gas phase acidities of fluorinated acetones. An ICR investigation of the role of fluorine substituents in the stabilization of planar carbanions,
Can. J. Chem., 1980, 58, 2307. [all data]
Larson and McMahon, 1984
Larson, J.W.; McMahon, T.B.,
Fluoride and chloride affinities of main group oxides, fluorides, oxofluorides, and alkyls. Quantitative scales of lewis acidities from ion cyclotron resonance halide-exchange equilibria,
J. Phys. Chem., 1984, 88, 1083. [all data]
Hunter and Lias, 1998
Hunter, E.P.; Lias, S.G.,
Evaluated Gas Phase Basicities and Proton Affinities of Molecules: An Update,
J. Phys. Chem. Ref. Data, 1998, 27, 3, 413-656, https://doi.org/10.1063/1.556018
. [all data]
Young and Cheng, 1976
Young, V.Y.; Cheng, K.L.,
The photoelectron spectra of halogen substituted acetones,
J. Chem. Phys., 1976, 65, 3187. [all data]
Metcalfe and Phillips, 1976
Metcalfe, J.; Phillips, D.,
J. Chem. Soc., Faraday Trans. II, 1976, 1574. [all data]