Methyl bicyclo[2.2.1]hepta-2,5-diene carboxylate

Gas phase ion energetics data

Data compiled as indicated in comments:
LBLHLM - Sharon G. Lias, John E. Bartmess, Joel F. Liebman, John L. Holmes, Rhoda D. Levin, and W. Gary Mallard

Ionization energy determinations

IE (eV) Method Reference Comment
8.92PEHouk, Rondan, et al., 1983Vertical value; LBLHLM

References

Houk, Rondan, et al., 1983
Houk, K.N.; Rondan, N.G.; Paddon-Row, M.N.; Jefford, C.W.; Huy, P.T.; Burrow, P.D.; Jordan, K.D., Ionization potentials, electron affinities, and molecular orbitals of 2-substituted norbornadienes. Theory of 1,2 and homo-1,4 carbene cycloaddition selectivities, J. Am. Chem. Soc., 1983, 105, 5563. [all data]