Formic-d acid,ethylester
- Formula: C3H5DO2
- Molecular weight: 75.0847
- IUPAC Standard InChIKey: WBJINCZRORDGAQ-WFVSFCRTSA-N
- CAS Registry Number: 35976-76-2
- Chemical structure:
View 3d structure (requires JavaScript / HTML 5) - Isotopologues:

Gas phase ion energetics data

Data compiled by: Henry M. Rosenstock, Keith Draxl, Bruce W. Steiner, and John T. Herron
Appearance energy determinations
Ion | AE (eV) | Other Products | Method | Reference | Comment |
---|---|---|---|---|---|
CDO2+ | 12.15 | C2H5 | EI | Bernecker and Long, 1961 | |
C2H4DO+ | 12.3 ± 0.1 | ? | EI | VanRaalte and Harrison, 1963 | |
C2H5O+ | 11.6 ± 0.1 | CDO? | EI | VanRaalte and Harrison, 1963 |

References

Bernecker and Long, 1961
Bernecker, R.R.; Long, F.,
Some organic positive ions and their parent radicals and molecules,
J. Phys. Chem., 1961, 65, 1565. [all data]
VanRaalte and Harrison, 1963
VanRaalte, D.; Harrison, A.G.,
Ionization and dissociation of formate esters by electron impact,
Can. J. Chem., 1963, 41, 2054. [all data]