Bis(trifluoromethyl)fluoroamine
- Formula: C2F7N
- Molecular weight: 171.0169
- IUPAC Standard InChIKey: JWDVRIOQNXFNES-UHFFFAOYSA-N
- CAS Registry Number: 359-62-6
- Chemical structure:
View 3d structure (requires JavaScript / HTML 5) - Permanent link for this species. Use this link for bookmarking this species for future reference.

Phase change data

Data compiled by: William E. Acree, Jr., James S. Chickos
Enthalpy of vaporization
ΔvapH (kJ/mol) | Temperature (K) | Method | Reference | Comment |
---|---|---|---|---|
21.4 | 215. | A | Stephenson and Malanowski, 1987 | Based on data from 199. to 230. K. |
18.6 | 218. | A | Stephenson and Malanowski, 1987 | Based on data from 203. to 233. K. See also Thompson, Emel«65533»us, et al., 1949. |

Gas phase ion energetics data

Data compiled as indicated in comments:
LBLHLM - Sharon G. Lias, John E. Bartmess, Joel F. Liebman, John L. Holmes, Rhoda D. Levin, and W. Gary Mallard
Ionization energy determinations
IE (eV) | Method | Reference | Comment |
---|---|---|---|
11.6 | PE | Burger, Pawelke, et al., 1982 | LBLHLM |
12.45 | PE | Burger, Pawelke, et al., 1982 | Vertical value; LBLHLM |

References

Stephenson and Malanowski, 1987
Stephenson, Richard M.; Malanowski, Stanislaw,
Handbook of the Thermodynamics of Organic Compounds, 1987, https://doi.org/10.1007/978-94-009-3173-2
. [all data]
Thompson, Emel«65533»us, et al., 1949
Thompson, J.; Emel«65533»us, H.J.; Davies, J.S.H.; Norris, W.L.,
Notes,
J. Chem. Soc., 1949, 3080, https://doi.org/10.1039/jr9490003080
. [all data]
Burger, Pawelke, et al., 1982
Burger, H.; Pawelke, G.; Dammel, R.; Bock, H.,
Effects of fluorine substitution on methyl amines,
J. Fluorine Chem., 1982, 19, 565. [all data]