Ethene, 2-chloro-1,1-difluoro-
- Formula: C2HClF2
- Molecular weight: 98.479
- IUPAC Standard InChIKey: HTHNTJCVPNKCPZ-UHFFFAOYSA-N
- CAS Registry Number: 359-10-4
- Chemical structure:
View 3d structure (requires JavaScript / HTML 5) - Other names: Ethylene, 2-chloro-1,1-difluoro-; Chloro-1,1-difluoroethylene; 1,1-Difluorochloroethylene; 2-Chloro-1,1-difluoroethylene; CF2=CHCl; 2,2-Difluoro-1-chloroethene; 1,1-Difluoro-2-chloroethylene; F 1122; FC 1122; HCFC 1122; R 1122; Ethene, 1,1-difluoro-2-chloro

Phase change data

Data compiled as indicated in comments:
BS - Robert L. Brown and Stephen E. Stein
TRC - Thermodynamics Research Center, NIST Boulder Laboratories, Chris Muzny director
AC - William E. Acree, Jr., James S. Chickos
Quantity | Value | Units | Method | Reference | Comment |
---|---|---|---|---|---|
Tboil | 256. | K | N/A | Farchan Laboratories, 1990 | BS |
Quantity | Value | Units | Method | Reference | Comment |
Tc | 400.55 | K | N/A | Mears, Stahl, et al., 1955 | Uncertainty assigned by TRC = 0.7 K; by sealed tube method; TRC |
Quantity | Value | Units | Method | Reference | Comment |
Pc | 44.6089 | bar | N/A | Mears, Stahl, et al., 1955 | Uncertainty assigned by TRC = 1.1032 bar; from vapor pressure equation at Tc; TRC |
Quantity | Value | Units | Method | Reference | Comment |
ρc | 5.07 | mol/l | N/A | Mears, Stahl, et al., 1955 | Uncertainty assigned by TRC = 0.15 mol/l; rectilinear diameters; TRC |
Enthalpy of vaporization
ΔvapH (kJ/mol) | Temperature (K) | Method | Reference | Comment |
---|---|---|---|---|
23.5 | 233. | BG | Mears, Stahl, et al., 1955, 2 | AC |
21.4 | 273. | BG | Mears, Stahl, et al., 1955, 2 | AC |
18.5 | 313. | BG | Mears, Stahl, et al., 1955, 2 | AC |
14.1 | 353. | BG | Mears, Stahl, et al., 1955, 2 | AC |

Reaction thermochemistry data

Data compiled by: Hussein Y. Afeefy, Joel F. Liebman, and Stephen E. Stein
Individual Reactions
By formula: H2 + C2Cl2F2 = C2HClF2 + HCl
Quantity | Value | Units | Method | Reference | Comment |
---|---|---|---|---|---|
ΔrH° | -90.21 | kJ/mol | Chyd | Lacher, Kianpour, et al., 1956 | gas phase; At 298 K |
By formula: 2H2 + C2HClF2 = C2H4F2 + HCl
Quantity | Value | Units | Method | Reference | Comment |
---|---|---|---|---|---|
ΔrH° | -258.4 | kJ/mol | Chyd | Lacher, Kianpour, et al., 1956 | gas phase; At 410 K |

Gas phase ion energetics data

Data evaluated as indicated in comments:
L - Sharon G. Lias
Data compiled as indicated in comments:
LLK - Sharon G. Lias, Rhoda D. Levin, and Sherif A. Kafafi
RDSH - Henry M. Rosenstock, Keith Draxl, Bruce W. Steiner, and John T. Herron
Quantity | Value | Units | Method | Reference | Comment |
---|---|---|---|---|---|
IE (evaluated) | 9.80 ± 0.04 | eV | N/A | N/A | L |
Ionization energy determinations
IE (eV) | Method | Reference | Comment |
---|---|---|---|
9.76 | S | Scott and Russell, 1972 | LLK |
9.84 | PE | Lake and Thompson, 1970 | RDSH |

Normal alkane RI, non-polar column, custom temperature program

Column type | Active phase | I | Reference | Comment |
---|---|---|---|---|
Capillary | SPB-1 | 339. | Flanagan, Streete, et al., 1997 | 60. m/0.53 mm/5. μm, He; Program: 40C(6min) => 5C/min => 80C => 10C/min => 200C |
Capillary | SPB-1 | 339. | Strete, Ruprah, et al., 1992 | 60. m/0.53 mm/5.0 μm, Helium; Program: 40 0C (6 min) 5 0C/min -> 80 0C 10 0C/min -> 200 0C |

References

Farchan Laboratories, 1990
Farchan Laboratories,
Research Chemicals Catalog, Farchan Laboratories, Gainesville, FL, 1990, 91. [all data]
Mears, Stahl, et al., 1955
Mears, W.H.; Stahl, R.F.; Orfeo, S.R.; Shair, R.C.; Kells, L.F.; Thompson, W.; McCann, H.,
Thermodynamic Properties of Halogenated Ethanes and Ethylenes,
Ind. Eng. Chem., 1955, 47, 1449. [all data]
Mears, Stahl, et al., 1955, 2
Mears, Whitney H.; Stahl, Richard F.; Orfeo, S. Robert; Shair, Robert C.; Kells, Lyman F.; Thompson, Walter; McCann, Harold,
Thermodynamic Properties of Halogenated Ethanes and Ethylenes,
Ind. Eng. Chem., 1955, 47, 7, 1449-1454, https://doi.org/10.1021/ie50547a052
. [all data]
Lacher, Kianpour, et al., 1956
Lacher, J.R.; Kianpour, A.; Oetting, F.; Park, J.D.,
Reaction calorimetry. The hydrogenation of organic fluorides and chlorides,
Trans. Faraday Soc., 1956, 52, 1500-1508. [all data]
Scott and Russell, 1972
Scott, J.D.; Russell, B.R.,
Vacuum-ultraviolet spectral studies of several chlorofluoroethylenes,
J. Am. Chem. Soc., 1972, 94, 2634. [all data]
Lake and Thompson, 1970
Lake, R.F.; Thompson, H.,
Photoelectron spectra of halogenated ethylenes,
Proc. Roy. Soc. (London), 1970, A315, 323. [all data]
Lacher and Park., 1950
Lacher, J.R.; Park., J.D.,
J. Am. Chem. Soc., 1950, 72, 5486. [all data]
Flanagan, Streete, et al., 1997
Flanagan, R.J.; Streete, P.J.; Ramsey, J.D.,
Volatile Substance Abuse, UNODC Technical Series, No 5, United Nations, Office on Drugs and Crime, Vienna International Centre, PO Box 500, A-1400 Vienna, Austria, 1997, 56, retrieved from http://www.odccp.org/pdf/technicalseries1997-01-011.pdf. [all data]
Strete, Ruprah, et al., 1992
Strete, P.J.; Ruprah, M.; Ramsey, J.D.; Flanagan, R.J.,
Detection and identification of volatile substances by headspace capillary gas chromatography to aid the diagnosis of acute poisoning,
Analyst, 1992, 117, 7, 1111-1127, https://doi.org/10.1039/an9921701111
. [all data]