1,3-Butadiene, 2-methoxy-
- Formula: C5H8O
- Molecular weight: 84.1164
- IUPAC Standard InChIKey: LYGKSUOGJYYSOI-UHFFFAOYSA-N
- CAS Registry Number: 3588-30-5
- Chemical structure:
View 3d structure (requires JavaScript / HTML 5) - Permanent link for this species. Use this link for bookmarking this species for future reference.

Gas phase ion energetics data

Data compiled by: Sharon G. Lias, Rhoda D. Levin, and Sherif A. Kafafi
Ionization energy determinations
IE (eV) | Method | Reference |
---|---|---|
8.43 | PE | Sustmann and Schubert, 1972 |

References

Sustmann and Schubert, 1972
Sustmann, R.; Schubert, R.,
Photoelektronenspektroskopische bestimmung von substituenten-effekten. I. Subtituierte butadiene,
Tetrahedron Lett., 1972, 27, 2739. [all data]