1,2-Dioxetane,3,3,4,4-tetramethyl-
- Formula: C6H12O2
- Molecular weight: 116.1583
- IUPAC Standard InChIKey: SSUHSLIAVJUONS-UHFFFAOYSA-N
- CAS Registry Number: 35856-82-7
- Chemical structure:
View 3d structure (requires JavaScript / HTML 5) - Permanent link for this species. Use this link for bookmarking this species for future reference.

Gas phase ion energetics data

Data compiled as indicated in comments:
LLK - Sharon G. Lias, Rhoda D. Levin, and Sherif A. Kafafi
Ionization energy determinations
IE (eV) | Method | Reference | Comment |
---|---|---|---|
9.26 ± 0.03 | PI | Trott, Blais, et al., 1978 | LLK |
8.53 | PE | Brown, 1975 | LLK |
Appearance energy determinations
Ion | AE (eV) | Other Products | Method | Reference | Comment |
---|---|---|---|---|---|
C5H9O2+ | 10.08 ± 0.05 | CH3 | PI | Trott, Blais, et al., 1978 | LLK |

References

Trott, Blais, et al., 1978
Trott, W.M.; Blais, N.C.; Walters, E.A.,
Molecular beam photoionization study of acetone and acetone-d6,
J. Chem. Phys., 1978, 69, 3150. [all data]
Brown, 1975
Brown, R.S.,
A photoelectron investigation of the peroxide bond,
Can. J. Chem., 1975, 53, 3439. [all data]