Silane, triethylfluoro-
- Formula: C6H15FSi
- Molecular weight: 134.2672
- IUPAC Standard InChIKey: QVMRVWAOMIXFFW-UHFFFAOYSA-N
- CAS Registry Number: 358-43-0
- Chemical structure:
View 3d structure (requires JavaScript / HTML 5) - Species with the same structure:
- Other names: Fluorotriethylsilane; Triethylfluorosilane; Triethylsilyl fluoride

Gas phase ion energetics data

Data compiled by: Sharon G. Lias, Rhoda D. Levin, and Sherif A. Kafafi
Ionization energy determinations
IE (eV) | Method | Reference | Comment |
---|---|---|---|
10.1 | PE | Roberge, Sandorfy, et al., 1978 | Vertical value |

References

Roberge, Sandorfy, et al., 1978
Roberge, R.; Sandorfy, C.; Matthews, J.I.; Strausz, O.P.,
The far ultraviolet HeI photoelectron spectra of alkyl and fluorine substituted silane derivatives,
J. Chem. Phys., 1978, 69, 5105. [all data]