N,N,N',N'-Tetramethyldithiooxamide
- Formula: C6H12N2S2
- Molecular weight: 176.303
- IUPAC Standard InChIKey: UTXPXIPWUGHKIQ-UHFFFAOYSA-N
- CAS Registry Number: 35840-78-9
- Chemical structure:
View 3d structure (requires JavaScript / HTML 5) - Permanent link for this species. Use this link for bookmarking this species for future reference.

Phase change data

Data compiled by: William E. Acree, Jr., James S. Chickos
Enthalpy of vaporization
ΔvapH (kJ/mol) | Temperature (K) | Method | Reference |
---|---|---|---|
60.5 | 533. | TGA,DSC | Clou, Janssens, et al., 2003 |
Enthalpy of fusion
ΔfusH (kJ/mol) | Temperature (K) | Method | Reference |
---|---|---|---|
21.0 | 409.2 | DSC | Clou, Janssens, et al., 2003 |

Gas phase ion energetics data

Data compiled as indicated in comments:
LLK - Sharon G. Lias, Rhoda D. Levin, and Sherif A. Kafafi
Ionization energy determinations
IE (eV) | Method | Reference | Comment |
---|---|---|---|
7.75 | PE | Henriksen, Isaksson, et al., 1981 | Vertical value; LLK |

References

Clou, Janssens, et al., 2003
Clou, K.; Janssens, J.F.; Blaton, N.; Lenstra, A.T.H.; Desseyn, H.O.,
Influence of hydrogen bonding on the thermal behaviour of some amides and thioamides,
Thermochimica Acta, 2003, 398, 1-2, 47-58, https://doi.org/10.1016/S0040-6031(02)00392-1
. [all data]
Henriksen, Isaksson, et al., 1981
Henriksen, L.; Isaksson, R.; Liljefors, T.; Sandstrom, J.,
Ultraviolet absorption and photoelectron spectra of some cyclic and open-chain mono- and dithiooxamides,
Acta Chem. Scand., Ser. B, 1981, 35, 489. [all data]